{"text_format":"1","workbook":"xlsx","n_sheets":7,"sheets":["README","OfficeForm","FieldBeeForm","BeeVegInputData","Bee_Scoring","VegTypeParameters","References"],"not_rendered":{"charts":0,"images":0,"macros":0,"external_links":0,"defined_names":9,"comments":0,"pivot_tables":0},"unopened":[],"bounds":{"document_bytes":16777216,"sheet_cells":100000,"rows_first":2000,"rows_last":500,"rows_between":2000,"halvings":0,"cell_chars":16384,"cell_head_chars":4096},"cells_cut":0,"cells_raw":0,"read":"whole","date_system":"1900"}

{"sheet":"README","index":0,"n_rows":12,"n_cols":4,"rows_kept":12,"cut":false,"hidden":false,"merged":[]}
[]
[]
[]
[]
[]
[]
[]
[]
[]
[]
[]
[null,null,null," "]

{"sheet":"OfficeForm","index":1,"n_rows":43,"n_cols":8,"rows_kept":43,"cut":false,"hidden":false,"merged":[[17,4,17,5],[18,4,18,5],[0,0,0,6],[3,1,3,6],[1,1,1,2],[1,4,1,6],[2,4,2,6],[38,5,38,6],[38,1,38,2],[6,0,6,6],[11,4,11,5],[12,4,12,5],[13,4,13,5],[14,4,14,5],[30,4,30,5],[23,4,23,5],[24,4,24,5],[7,4,7,5],[8,4,8,5],[10,4,10,5],[15,4,15,5],[9,4,9,5],[22,4,22,5],[39,0,42,0],[33,0,37,0],[32,5,32,6],[31,0,31,6],[29,1,30,1],[32,1,32,2],[7,0,30,0],[25,4,25,5],[26,4,26,5],[27,4,27,5],[28,4,28,5],[20,4,20,5],[21,4,21,5],[7,1,28,1],[19,4,19,5],[16,4,16,5]]}
["Pollinator Habitat Office Data: Fill in answers directly from Field Data Sheets. Do NOT write in gray areas. See directions booklet for additional explanations."]
["Site Name",null,null,"Field observer name"," ",null,null," "]
[null,null," ","Date recorder name"]
["Notes"]
["Value and Opportunity for Pollinators"]
["Indicator","Variable Number","Variable","Data","Data","Explanations and Definitions","Notes"]
["Opportunity and Value Scoring for Project Area"]
["Percent cover by land use categories within 0.5 miles of Project Area",1,"Urban/built:",0,"Impervious/paved areas (paved parking lots, industrial and commercial areas), dam",null,"Does not provide bee resources."]
[null,null,"Paved road:",0.01,"Paved county roads, highways",null,"Does not provide bee resources."]
[null,null,"Suburban open:",0,"Neighborhoods with little canopy cover (includes streets, yards, houses)",null,"Does not provide bee resources."]
[null,null,"Suburban wooded*:",0,"Neighborhoods with dense canopy cover",null,"May provide bee resources."]
[null,null,"Exurban*:",0.02,"Farm operations and homesteads in areas where neighbors are not close together, often adjacent to ag fields (includes yards, trees, paved driveways, garages)",null,"May provide bee resources."]
[null,null,"Dirt road:",0.01,"Includes possible gravel roads",null,"Does not provide bee resources."]
[null,null,"Annual crop*:",0.49,"Agricultural fields planted with seasonal row crops",null,"May provide bee resources."]
[null,null,"Orchard-Vineyard crop:",0.12,"Agricultural fields planted with perennial crops, includes orchards and vineyards",null,"May provide bee resources."," "]
[null,null,"Rice:",0,"Agricultural fields planted with rice",null,"Does not provide bee resources."]
[null,null,"Non-agricultural plantings*:",0,"Non-agricultural plantings; examples include hedgerows, rows of Eucalytpus along road, plantings along irrigation ditches, and other plantings that are clearly not naturally occurring but do not fit into \"crop\" categories",null,"May provide bee resources."]
[null,null,"Bare*:",0.03,"Appears to be bare dirt (like dirt road) but is not a road; could be dirt parking area, road shoulder, or bare patch in field",null,"May provide bee resources."]
[null,null,"Weedy/sparse scrub*:",0.01,"Areas that appear to have more than just grassy vegetation (presumably weeds), sometimes including an occasional shrub; road and field edges often fit into this category",null,"May provide bee resources."]
[null,null,"Grass*:",0.1,"Includes mowed, unmowed, annual and perennial",null,"May provide bee resources."]
[null,null,"Chaparral*:",0,"Located usually on SW facing slopes of more xeric areas, near oak woodland, usually low canopy height",null,"May provide bee resources."]
[null,null,"Oak savannah*:",0,"Natural-looking grassy/scrubby areas with mixed oak/pine tree spp. scattered throughout",null,"May provide bee resources."]
[null,null,"Oak woodland*:",0.03,"Also includes scrub-oak: natural-looking areas containing mixed oak/pine tree spp. growing more densely than \"oak savannah”",null,"May provide bee resources."]
[null,null,"Riparian forest*:",0.04,"Land along natural waterways (not irrigation ditches) containing dense tree growth, even if forest strip consists of a single line of trees",null,"May provide bee resources."]
[null,null,"Riparian scrub*:",0.08,"Land along waterways containing shrubs or trees but not dense canopy cover",null,"May provide bee resources."]
[null,null,"Water*:",0.06,"Ponds, rivers, canals, drainage ponds, etc.",null,"May provide bee resources."]
[null,null,"Emergent herbaceous wetlands*:",0,"Wetlands often adjacent to open water but not riparian scrub",null,"May provide bee resources."]
[null,null,"Total (should be 100%)",{"$f":"SUM(D8:D27)","v":1},"Calculation cell.  Do not enter anything in D23.",null,"Should total 100%.  Source for landuse categories and definitions is Kremen 2010."]
[null,null,"*Total 'wild' habitat that provides bee resources:",{"$f":"D11+D12+D14+D17+D18+D19+D20+D21+D22+D23+D24+D25+D26+D27","v":0.8600000000000001},"Calculation cell.  Do not enter anything in D25.",null,"Only the starred (*) variables are summed here."]
[null,2,"Percent cover of pollinator dependent crops within 0.5 miles of Project Area",0.14000000000000001,{"$f":"+D30*FieldBeeForm!F8","v":102.71865351886296},"Enter total percent cover across all pollinator dependent crops in D25. Approximate acres of 0.5 buffer in pollinator-dependent crops automatically calculated in Column E (leave alone). ","Pollinator dependent crops indicate a value and opportunity for increased pollinator services within bee flight distance from the project area (~0.5 mi). Overall, a 1.5 to 25 ratio of pollinator habitat to pollinator dependent crops is recommended by NRCS 2009 document."]
[null,null,"    Crop Type(s):"," ","Type crop types in blank in C26 ; leave D26 blank."]
["Site Capacity Scoring for Project Area",null,null,null,null,null,null," "]
["Site Management","Insecticide Management",null,"Within PA + 50 ft buffer","Within 0.5 mi buffer","On the project area map, draw a 50’ buffer around the Project Area and refer to the area inside this buffer, including the PA itself, to answer the left side columns. Use the 0.5 mile buffer created for Variable 1, but only including lands that are managed and/or controlled by the applicant, to answer the right side columns."]
["Insecticide use",3,"Are pesticides (insecticides, fungicides, etc.) used 2 or more times a year, between Mar. 1st & Nov. 1st?",1,0,"In Column D, enter '1' for Yes or a '0' for No for application within the PA and a 50 foot buffer.  In Column E, enter '1' for Yes or a '0' for No for application within a 0.5 mi buffer of, but not including, the PA.","0 is good"]
[null,4,"If insecticides are used 2+ times a year (between Mar. 1st & Nov. 1st), are broad-spectrum or soil fumigants used, or any pesticides that are labeled toxic to honeybees?",1,0,"In Column D, enter '1' for Yes or a '0' for No for within the PA and a 50 foot buffer.  In Column E, enter '1' for Yes or a '0' for No for within a 0.5 mi buffer of, but not including, the PA.","0 is good"]
[null,5,"If insecticides are used 2+ times a year (between Mar. 1st & Nov. 1st), are they used outside of the crop blooming period?",0,0,"In Column D, enter '1' for Yes or a '0' for No for within the PA and a 50 foot buffer.  In Column E, enter '1' for Yes or a '0' for No for within a 0.5 mi buffer of, but not including, the PA.","1 is good"]
[null,6,"If insecticides are used 2+ times a year (between Mar. 1st & Nov. 1st), are they only used when bees are not active (i.e., at night)?",0,0,"In Column D, enter '1' for Yes or a '0' for No for within the PA and a 50 foot buffer.  In Column E, enter '1' for Yes or a '0' for No for within a 0.5 mi buffer of, but not including, the PA.","1 is good"]
[null,7,"If insecticides are used 2+ times a year (between Mar. 1st & Nov. 1st), what is the application method?",1,0,"In Columns D and E (for PA +50' and 0.5 buffer), enter '4' for no pesticides applied; '3' for hand application; '2' for tractor and boom application; '1' for other ground based method; and '0' for aerial application via an air craft.  If you entered '1', enter method in Column G.","4 is good"]
[null,"Managed Bees",null,"PA and a 2 mi buffer around PA",null,"On the project area map (and/or google earth), draw a 2 mile buffer around the PA (extending 2 miles from PA boundaries) and refer to the area within this buffer (including PA itself) to answer the left side columns (Column D).  "]
["Managed bee information",8,"Do you host managed honeybees anytime except winter (Nov-Feb) and/or during crop bloom time?",0,null,"In Column D, enter '1' for Yes or a '0' for No. Enter nothing in column E. ","0 is good, 1 is conditional on 9 and 10."]
[null,9,"If you answered ‘Yes’ to #8, are the managed bee hives  within the 2 mile buffer of the Project Area?",0,null,"In Column D, enter '1' for Yes or a '0' for No. Enter '0' (no), even if you said 'no' for the above question(s). Enter nothing in column E.","0 is good, 1 is conditional on 10."]
[null,10,"If you answered ‘Yes’ to #9, is there more than 1 hive of managed bees per acre of habitat within PA and a 2 mi buffer, where habitat can include both PA and permanently protected other habitat? ",0,null,"In Column D, enter '1' for Yes or a '0' for No. Enter '0' (no), even if you said 'no' for the above question(s). Enter nothing in column E.","0 is good"]
[null,11,"If you answered ‘Yes’ to #10, write down how many hives you have/host within the PA and within a 2 mi buffer during the non-winter and no crop bloom periods.",0,null,"In Column D, enter the number of hives you host within the PA and a  2 mi buffer; enter '0' for no hives.  Enter nothing in column E.","0 is good"]

{"sheet":"FieldBeeForm","index":2,"n_rows":520,"n_cols":15,"rows_kept":520,"cut":false,"hidden":false,"merged":[[515,1,519,1],[515,7,515,11],[515,12,515,14],[516,7,516,11],[516,12,516,14],[517,7,517,11],[517,12,517,14],[518,7,518,11],[518,12,518,14],[519,7,519,11],[519,12,519,14],[504,12,504,14],[505,7,505,11],[505,12,505,14],[509,7,509,11],[509,12,509,14],[510,1,514,1],[510,7,510,11],[510,12,510,14],[511,7,511,11],[511,12,511,14],[512,7,512,11],[512,12,512,14],[513,7,513,11],[513,12,513,14],[514,7,514,11],[514,12,514,14],[493,1,493,4],[493,5,493,6],[493,8,493,14],[494,7,494,10],[495,0,519,0],[495,1,500,1],[495,7,497,11],[495,12,497,14],[498,9,500,11],[498,12,500,14],[501,1,509,1],[501,7,501,11],[501,12,501,14],[502,7,502,11],[502,12,502,14],[503,7,503,11],[506,7,506,11],[506,12,506,14],[507,7,507,11],[507,12,507,14],[508,7,508,11],[508,12,508,14],[503,12,503,14],[504,7,504,11],[462,1,466,1],[462,7,462,11],[462,12,462,14],[463,7,463,11],[463,12,463,14],[464,7,464,11],[464,12,464,14],[465,7,465,11],[465,12,465,14],[466,7,466,11],[466,12,466,14],[451,12,451,14],[452,7,452,11],[452,12,452,14],[456,7,456,11],[456,12,456,14],[457,1,461,1],[457,7,457,11],[457,12,457,14],[458,7,458,11],[458,12,458,14],[459,7,459,11],[459,12,459,14],[460,7,460,11],[460,12,460,14],[461,7,461,11],[461,12,461,14],[440,1,440,4],[440,5,440,6],[440,8,440,14],[441,7,441,10],[442,0,466,0],[442,1,447,1],[442,7,444,11],[442,12,444,14],[445,9,447,11],[445,12,447,14],[448,1,456,1],[448,7,448,11],[448,12,448,14],[449,7,449,11],[449,12,449,14],[450,7,450,11],[453,7,453,11],[453,12,453,14],[454,7,454,11],[454,12,454,14],[455,7,455,11],[455,12,455,14],[450,12,450,14],[451,7,451,11],[409,1,413,1],[409,7,409,11],[409,12,409,14],[410,7,410,11],[410,12,410,14],[411,7,411,11],[411,12,411,14],[412,7,412,11],[412,12,412,14],[413,7,413,11],[413,12,413,14],[398,12,398,14],[399,7,399,11],[399,12,399,14],[403,7,403,11],[403,12,403,14],[404,1,408,1],[404,7,404,11],[404,12,404,14],[405,7,405,11],[405,12,405,14],[406,7,406,11],[406,12,406,14],[407,7,407,11],[407,12,407,14],[408,7,408,11],[408,12,408,14],[387,1,387,4],[387,5,387,6],[387,8,387,14],[388,7,388,10],[389,0,413,0],[389,1,394,1],[389,7,391,11],[389,12,391,14],[392,9,394,11],[392,12,394,14],[395,1,403,1],[395,7,395,11],[395,12,395,14],[396,7,396,11],[396,12,396,14],[397,7,397,11],[400,7,400,11],[400,12,400,14],[401,7,401,11],[401,12,401,14],[402,7,402,11],[402,12,402,14],[397,12,397,14],[398,7,398,11],[356,1,360,1],[356,7,356,11],[356,12,356,14],[357,7,357,11],[357,12,357,14],[358,7,358,11],[358,12,358,14],[359,7,359,11],[359,12,359,14],[360,7,360,11],[360,12,360,14],[345,12,345,14],[346,7,346,11],[346,12,346,14],[350,7,350,11],[350,12,350,14],[351,1,355,1],[351,7,351,11],[351,12,351,14],[352,7,352,11],[352,12,352,14],[353,7,353,11],[353,12,353,14],[354,7,354,11],[354,12,354,14],[355,7,355,11],[355,12,355,14],[334,1,334,4],[334,5,334,6],[334,8,334,14],[335,7,335,10],[336,0,360,0],[336,1,341,1],[336,7,338,11],[336,12,338,14],[339,9,341,11],[339,12,341,14],[342,1,350,1],[342,7,342,11],[342,12,342,14],[343,7,343,11],[343,12,343,14],[344,7,344,11],[347,7,347,11],[347,12,347,14],[348,7,348,11],[348,12,348,14],[349,7,349,11],[349,12,349,14],[344,12,344,14],[345,7,345,11],[303,1,307,1],[303,7,303,11],[303,12,303,14],[304,7,304,11],[304,12,304,14],[305,7,305,11],[305,12,305,14],[306,7,306,11],[306,12,306,14],[307,7,307,11],[307,12,307,14],[292,12,292,14],[293,7,293,11],[293,12,293,14],[297,7,297,11],[297,12,297,14],[298,1,302,1],[298,7,298,11],[298,12,298,14],[299,7,299,11],[299,12,299,14],[300,7,300,11],[300,12,300,14],[301,7,301,11],[301,12,301,14],[302,7,302,11],[302,12,302,14],[281,1,281,4],[281,5,281,6],[281,8,281,14],[282,7,282,10],[283,0,307,0],[283,1,288,1],[283,7,285,11],[283,12,285,14],[286,9,288,11],[286,12,288,14],[289,1,297,1],[289,7,289,11],[289,12,289,14],[290,7,290,11],[290,12,290,14],[291,7,291,11],[294,7,294,11],[294,12,294,14],[295,7,295,11],[295,12,295,14],[296,7,296,11],[296,12,296,14],[291,12,291,14],[292,7,292,11],[250,1,254,1],[250,7,250,11],[250,12,250,14],[251,7,251,11],[251,12,251,14],[252,7,252,11],[252,12,252,14],[253,7,253,11],[253,12,253,14],[254,7,254,11],[254,12,254,14],[239,12,239,14],[240,7,240,11],[240,12,240,14],[244,7,244,11],[244,12,244,14],[245,1,249,1],[245,7,245,11],[245,12,245,14],[246,7,246,11],[246,12,246,14],[247,7,247,11],[247,12,247,14],[248,7,248,11],[248,12,248,14],[249,7,249,11],[249,12,249,14],[228,1,228,4],[228,5,228,6],[228,8,228,14],[229,7,229,10],[230,0,254,0],[230,1,235,1],[230,7,232,11],[230,12,232,14],[233,9,235,11],[233,12,235,14],[236,1,244,1],[236,7,236,11],[236,12,236,14],[237,7,237,11],[237,12,237,14],[238,7,238,11],[241,7,241,11],[241,12,241,14],[242,7,242,11],[242,12,242,14],[243,7,243,11],[243,12,243,14],[238,12,238,14],[239,7,239,11],[197,1,201,1],[197,7,197,11],[197,12,197,14],[198,7,198,11],[198,12,198,14],[199,7,199,11],[199,12,199,14],[200,7,200,11],[200,12,200,14],[201,7,201,11],[201,12,201,14],[186,12,186,14],[187,7,187,11],[187,12,187,14],[191,7,191,11],[191,12,191,14],[192,1,196,1],[192,7,192,11],[192,12,192,14],[193,7,193,11],[193,12,193,14],[194,7,194,11],[194,12,194,14],[195,7,195,11],[195,12,195,14],[196,7,196,11],[196,12,196,14],[175,1,175,4],[175,5,175,6],[175,8,175,14],[176,7,176,10],[177,0,201,0],[177,1,182,1],[177,7,179,11],[177,12,179,14],[180,9,182,11],[180,12,182,14],[183,1,191,1],[183,7,183,11],[183,12,183,14],[184,7,184,11],[184,12,184,14],[185,7,185,11],[188,7,188,11],[188,12,188,14],[189,7,189,11],[189,12,189,14],[190,7,190,11],[190,12,190,14],[185,12,185,14],[186,7,186,11],[144,1,148,1],[144,7,144,11],[144,12,144,14],[145,7,145,11],[145,12,145,14],[146,7,146,11],[146,12,146,14],[147,7,147,11],[147,12,147,14],[148,7,148,11],[148,12,148,14],[133,12,133,14],[134,7,134,11],[134,12,134,14],[138,7,138,11],[138,12,138,14],[139,1,143,1],[139,7,139,11],[139,12,139,14],[140,7,140,11],[140,12,140,14],[141,7,141,11],[141,12,141,14],[142,7,142,11],[142,12,142,14],[143,7,143,11],[143,12,143,14],[122,1,122,4],[122,5,122,6],[122,8,122,14],[123,7,123,10],[124,0,148,0],[124,1,129,1],[124,7,126,11],[124,12,126,14],[127,9,129,11],[127,12,129,14],[130,1,138,1],[130,7,130,11],[130,12,130,14],[131,7,131,11],[131,12,131,14],[132,7,132,11],[135,7,135,11],[135,12,135,14],[136,7,136,11],[136,12,136,14],[137,7,137,11],[137,12,137,14],[132,12,132,14],[133,7,133,11],[91,1,95,1],[91,7,91,11],[91,12,91,14],[92,7,92,11],[92,12,92,14],[93,7,93,11],[93,12,93,14],[94,7,94,11],[94,12,94,14],[95,7,95,11],[95,12,95,14],[80,12,80,14],[81,7,81,11],[81,12,81,14],[85,7,85,11],[85,12,85,14],[86,1,90,1],[86,7,86,11],[86,12,86,14],[87,7,87,11],[87,12,87,14],[88,7,88,11],[88,12,88,14],[89,7,89,11],[89,12,89,14],[90,7,90,11],[90,12,90,14],[69,1,69,4],[69,5,69,6],[69,8,69,14],[70,7,70,10],[71,0,95,0],[71,1,76,1],[71,7,73,11],[71,12,73,14],[74,9,76,11],[74,12,76,14],[77,1,85,1],[77,7,77,11],[77,12,77,14],[78,7,78,11],[78,12,78,14],[79,7,79,11],[82,7,82,11],[82,12,82,14],[83,7,83,11],[83,12,83,14],[84,7,84,11],[84,12,84,14],[79,12,79,14],[80,7,80,11],[34,12,34,14],[7,7,7,14],[8,7,8,14],[9,7,9,14],[10,7,10,14],[11,7,11,14],[18,12,20,14],[21,12,23,14],[24,12,24,14],[34,7,34,11],[33,12,33,14],[27,12,27,14],[28,12,28,14],[29,12,29,14],[30,12,30,14],[31,12,31,14],[32,12,32,14],[25,12,25,14],[26,12,26,14],[35,12,35,14],[36,12,36,14],[40,7,40,11],[41,7,41,11],[37,12,37,14],[35,7,35,11],[36,7,36,11],[42,12,42,14],[38,7,38,11],[39,7,39,11],[40,12,40,14],[41,12,41,14],[38,12,38,14],[39,12,39,14],[0,0,0,14],[4,0,4,14],[17,7,17,10],[12,3,13,3],[12,2,13,2],[16,1,16,4],[6,0,6,14],[7,1,14,1],[7,0,14,0],[5,6,5,14],[1,1,1,2],[2,1,2,2],[1,4,1,6],[2,4,2,6],[16,5,16,6],[2,7,2,8],[1,7,1,8],[16,8,16,14],[3,7,3,14],[1,9,1,12],[2,9,2,12],[15,0,15,14],[3,1,3,6],[18,0,42,0],[37,7,37,11],[42,7,42,11],[18,7,20,11],[24,7,24,11],[18,1,23,1],[21,9,23,11],[33,7,33,11],[26,7,26,11],[33,1,37,1],[38,1,42,1],[27,7,27,11],[28,7,28,11],[29,7,29,11],[30,7,30,11],[31,7,31,11],[24,1,32,1],[32,7,32,11],[25,7,25,11]]}
["Pollinator Habitat Field Data: Fill in answers directly from Field Data Sheets. Do NOT write in gray areas. See directions booklet for additional explanations."]
["Site Name",null,null,"Field observer name"," ",null,null,"Date"]
[null,null,null,"Data recorder name",null,null,null,"PA acres "]
["Notes",null,null,null,null,null,null,"Do not enter data in gray-shaded cells, as gray-shaded cells are either calculation cells or are not used for that particular variable."]
["If project area extends over 10 acres or 0.5 miles long, then divide project area into ≤10-acre or ≤0.5 mi-long Map Units.  If site topography, layout, or the habitat/communities present facilitate the use of smaller Map Units, then divide into smaller units.  Note, no single Map Unit should be smaller than 40 ft x 225 ft (or 0.2 acres).\nLabel Map Units on Project Area Map (field print out). Record responses to each of the questions from the Pollinators Field Data sheet for each of these Map Units in the spaces below. For each Map Unit, move to a new set of questions in the rows below (there are 10 sets of questions provided for a maximum of 10 Map Units). "]
["Area Considered","Indicator","Variable Number","Variable","Data","Calculation Cells","Explanations and Definitions"]
["Project Area Overview Information"]
["Full Project Area","Project Size and Age","A","Overall project area (in acres):",3.2,{"$f":"640*((((E8*0.0015625)^0.5)+1)^2)-(E8*0.0015625)","v":733.7046679918783},{"$f":"+OfficeForm!E30/FieldBeeForm!E8","v":32.099579224644671},"The Project Area should include the area planned to include any pollinator resources - including both floral and nesting resources.  For example, if logs will be staged near the planted area for potential nesting material, the Project Area should include the area with logs. The approximate 0.5 buffer area (in acres) and ratio of project area to buffer area with pollinator dependent crops is automatically calculated in Columns F and G; please do not touch these columns."]
[null,null,"B","Percent of project area that currently supports pollinator foraging habitat:",20,{"$f":"+(E9/100)*E8","v":0.64000000000000012},null,"Acres of project area with pollinator foraging habitat: "]
[null,null,"C","Number of 10 (or less)-acre Map Units:",5," ",null,"Enter number of Map Units included in Project Area."]
[null,null,"D","Assessment Year ",12,null,null,"Current year = 0; future prediction years are one year post restoration = 1, two years post restoration = 2, etc."]
[null,null,"E","Farm size (acres)",100,{"$f":"+E8/E12","v":3.2000000000000001E-2},null,"Enter total acres of land in the farm (percentage of farm in Project Area calculated in Column F)"]
[null,null,"F","Map Unit area (square feet)","MU1","MU2","MU 3","MU4","MU 5","MU 6","MU 7","MU 8","MU 9","MU 10"]
[null,null,null,null,13190,50000,300000,20000,20000,20000,20000,20000,20000,20000,"Enter MU sizes based on either field measurements or GIS based calculations from digitized maps."]
[null,null,"G","Percent of area within each Map Unit that is currently supporting floral resources ",55,10,55,25,25,25,25,25,25,25,"Enter as percentage: e.g. '10' for 10%."]
["Project Area Site Capacity"]
["Map Unit Number","Map Unit Information (1)",null,null,null,"Map Unit Acres:",null,{"$f":"E$14/43560","v":0.30280073461891643}]
[1,"Indicator","Variable Number","Variable","Data\n","Min of range","Max of range","Explanations and Definitions",null,null,null,null,null,null,"Notes"]
[null,"Floral Resources",12,"Number of different flowering plant species present during early-blooming (Feb-May) period",-1,{"$f":"BeeVegInputData!L81","v":7},{"$f":"+IF(E19=-1,F19,E19)","v":7},"Enter nothing here. These values will be automatically entered in Columns F and G based on your entries to the BeeVegInputData worksheet. Enter data in to that worksheet (directions are at top of worksheet). ",null,null,null,null,"Target is 5 or more species for each blooming season. Note that if there are any invasive weed or plants 'not beneficial to pollinators' species on the list, they do not count towards the total.  Nonnative species can count as 0.5 pts.  "]
[null,null,13,"Number of different flowering plants present during mid-blooming (Jun-Jul) period",-1,{"$f":"BeeVegInputData!M81","v":10},{"$f":"+IF(E20=-1,F20,E20)","v":10}]
[null,null,14,"Number of different flowering plants present during late-blooming (Aug-Jan) period",-1,{"$f":"+BeeVegInputData!N81","v":7},7]
[null,null,15,"Estimated surface area of flowering plants present during early-blooming (Feb-May) period",-1,{"$f":"(MAX(G22:H22))/(E$14)","v":2.6028867366049589E-3},{"$f":"IF((BeeVegInputData!E81<=BeeVegInputData!I81),(BeeVegInputData!E81),(BeeVegInputData!I81))","v":23.819950566490657},{"$f":"IF((BeeVegInputData!E81>BeeVegInputData!I81),(BeeVegInputData!E81),(BeeVegInputData!I81))","v":34.332076055819407},{"$f":"+IF(E22=-1,F22,E22)","v":2.6028867366049589E-3},"Enter nothing here. These values will automatically be entered from the BeeVegInputData worksheet. Enter data in to that worksheet.",null,null,"Minimum and maximum values are pulled from the BeeVegInputData worksheet into Columns G and H (square meters); then the maximum of these two values is converted into a percentage of the total Map Unit in Column F. "]
[null,null,16,"Estimated surface area of flowering plants present during mid-blooming (Jun-Jul) period",-1,{"$f":"(MAX(G23:H23))/(E$14)","v":1.401313405943653E-3},{"$f":"IF((BeeVegInputData!F81<=BeeVegInputData!J81),(BeeVegInputData!F81),(BeeVegInputData!J81))","v":11.803016392869374},{"$f":"IF((BeeVegInputData!F81>BeeVegInputData!J81),(BeeVegInputData!F81),(BeeVegInputData!J81))","v":18.483323824396784},{"$f":"+IF(E23=-1,F23,E23)","v":1.401313405943653E-3}]
[null,null,17,"Estimated surface area of flowering plants present during late-blooming (Aug-Jan) period",-1,{"$f":"(MAX(G24:H24))/(E$14)","v":1.0956260816411074E-3},{"$f":"IF((BeeVegInputData!G81<=BeeVegInputData!K81),(BeeVegInputData!G81),(BeeVegInputData!K81))","v":10.201461920161677},{"$f":"IF((BeeVegInputData!G81>BeeVegInputData!K81),(BeeVegInputData!G81),(BeeVegInputData!K81))","v":14.451308016846207},{"$f":"+IF(E24=-1,F24,E24)","v":1.0956260816411074E-3}]
[null,"Nesting Resources",18,"Percent cover of friable bare ground present",{"$f":"IF(MAX(F25:G25)>=0.3,0.3,(AVERAGE(F25:G25)))","v":5.5E-2},0.01,0.1,"Enter percent cover range min and max values (0, 1-10, 11-20, 21-30, 31-100) in Columns F and G.",null,null,null,null,"Target is 10-30% ('30')"]
[null,null,19,"Number of rodent holes present",1,null,null,"Enter count bins ('0' for none, '1' for few [1-10], and '2' for many [>10]) in Column E. ",null,null,null,null,"Target is few or many.  For model, combine rodent holes/bunchgrasses."]
[null,null,20,"Amount of bunch grasses present",1," "," ","Enter percent cover bin in Column E: '0' for 0%, '1' for 1 to 5%, and '2' for greater than or equal to 5%. ",null,null,null,null,"Target is 5-25.  For model rodent holes/bunchgrasses are combined."]
[null,null,{"$f":"CONCATENATE(C26,\" and \",C27)","v":"19 and 20"},"Amount of rodent holes and/or bunch grasses",{"$f":"IF((E26=2),2,(IF((E27=2),2,(IF((E26=1),1,(IF((E27=1),1,0)))))))","v":1},null,null,"Calculation cell to combine rodent holes with bunch grasses.  ",null,null,null,null,"Target is few or many."]
[null,null,21,"Amount of snags/stumps present",1,null,null,"Enter count bins ('0' for none, '1' for few [1-10], and '2' for many [>10]) in Column E. ",null,null,null,null,"Target is few or many.  For model, combine snags/nest boxes/pithy."]
[null,null,22,"Amount of nest boxes or nest bundles present",0,null,null,"In Column E, enter count bins ('0' for none, '0.5' for few [1-3] that are close and/or not maintained, '1' for few [1-3]) that are >50 holes or maintained, '1.5' for few [1-3] that are both >50 holes and maintained, '2' for many [>3] that are both >50 holes and maintained.  Give an extra point for multiple sized holes and/or small blocks w/less than 20 holes. Maximum is 3.",null,null,null,null,"Target many, maintained, etc..  For model, combine snags/nest boxes/pithy."]
[null,null,23,"Amount of plants with pithy tissue present",1," "," ","Total for percent cover for all relevant species documented, then in Column E, enter appropriate bin for total percent cover range:  enter '0' for <1%, enter '1' for 1 to 5%, and enter '2' for over 5%.",null,null,null,null,"Target is 5-25.  For model, combine snags/nest boxes/pithy."]
[null,null,{"$f":"CONCATENATE(C29,\", \",C30,\" and \",C31)","v":"21, 22 and 23"},"Amount of snags/stumps, nest boxes/bundles, pithy tissue",{"$f":"IF((E29=2),2,(IF((E30>=2),2,(IF((E31=2),2,(IF((E29=1),1,(IF((E30=1.5),1,(IF((E30=1),1,(IF((E31=1),1,0)))))))))))))","v":1},null,null,"Calculation cell to combine snags/stumps, nest boxes/bundles, and pithy tissue.  ",null,null,null,null,"Target is few or many."]
[null,null,{"$f":"CONCATENATE(C25,\" through \",C31)","v":"18 through 23"},"Diversity of available nesting materials",{"$f":"((IF(E25>0.09,1,0))+(IF(E28>0,1,0))+(IF(E32>0,1,0)))/3","v":0.66666666666666663},null,null,"Calculation cell.  Treat questions 8-10 separately and 11-13 combined (e.g., if a site has snags, nest boxes, or plants with pithy tissues, it counts towards the site diversity).",null,null,null,null,"Target is 1.0"]
[null,"Management: Soil disturbance",24,"Is the Map Unit tilled at some point during the year?",1,null,null,"In Column E, enter '1' for Yes or a '0' for No.",null,null,null,null,"0 is good"]
[null,null,25,"Is the Map Unit flood-irrigated at some point during the year?",0,null,null,"In Column E, enter '1' for Yes or a '0' for No.",null,null,null,null,"0 is good"]
[null,null,26,"Is plastic mulching used at the Map Unit?",1,null,null,"In Column E, enter '1' for Yes or a '0' for No.",null,null,null,null,"0 is good"]
[null,null,27,"Does road-grading or road-making occur on the Map Unit?",1,null,null,"In Column E, enter '1' for Yes or a '0' for No.",null,null,null,null,"0 is good"]
[null,null,28,"Total percent cover of the Map Unit that experiences any soil disturbance",{"$f":"MAX(F38:G38)","v":0.6},0.3,0.6,"Enter the percent cover inclusive of all types of soil disturbance min and max values (0, 1-10, 10-30, 30-60, 60-90, 90-100) in Columns F and G.",null,null,null,null,"0 is good"]
[null,"Management: Vegetation/ground disturbance",29,"Total cover of invasive noxious weeds",{"$f":"MAX(F39:G39)","v":0},0,0,"Enter total percent cover combined for all invasive noxious weeds documented min and max values (0, 0-1, 1-5, 5-25, 25-50, 50-75, 75-95, 95-100) in Columns F and G.",null,null,null,null,"0 is good"]
[null,null,30,"Number of invasive noxious weed species",5,null,null,"Enter count in Column E.  If there are 5 or more species, enter '5'.",null,null,null,null,"0 is good"]
[null,null,31,"Percent of the Map Unit burned during the blooming season (Feb through Sept)",{"$f":"MAX(F41:G41)","v":0},0,0,"Enter percent cover range min and max values (0, 1-10, 10-30, 30-60, 60-90, 90-100) in Columns F and G.",null,null,null,null,"0 is good"]
[null,null,32,"Percent of the Map Unit mowed and/or hayed during the blooming season (Feb through Sept)",{"$f":"MAX(F42:G42)","v":0.1},0.01,0.1,"Enter percent cover range min and max values (0, 1-10, 10-30, 30-60, 60-90, 90-100) in Columns F and G.",null,null,null,null,"0 is good"]
[null,null,33,"Total percent of the Map Unit burned, mowed, or hayed during the blooming season",{"$f":"MAX(F43:G43)","v":0.3},0.1,0.3,"Enter percent cover range min and max values (0, 1-10, 10-30, 30-60, 60-90, 90-100) in Columns F and G.",null,null,null,null,"0 is good"]
[]
[]
[]
[]
[]
[]
[]
[]
[]
[]
[]
[]
[]
[]
[]
[]
[]
[]
[]
[]
[]
[]
[]
[]
[]
[]
["Map Unit Number","Map Unit Information (2)",null,null,null,"Map Unit Acres:",null,{"$f":"F$14/43560","v":1.1478420569329659}]
[2,"Indicator","Variable Number","Variable","Data\n","Min of range","Max of range","Explanations and Definitions",null,null,null,null,null,null,"Notes"]
[null,"Floral Resources",12,"Number of different flowering plant species present during early-blooming (Feb-May) period",-1,{"$f":"BeeVegInputData!L159","v":7},{"$f":"+IF(E72=-1,F72,E72)","v":7},"Enter nothing here. These values will be automatically entered in Columns F and G based on your entries to the BeeVegInputData worksheet. Enter data in to that worksheet (directions are at top of worksheet). ",null,null,null,null,"If there are 5 or more species, enter '5'.  If a species straddles the blooming periods, only count in a season if it straddles over half the season.  Target is 5 or more. Note that if there are any invasive weed or plants 'not beneficial to pollinators' species on the list, they do not count towards the total.  Nonnative species can count as 0.5 pts.  "]
[null,null,13,"Number of different flowering plants present during mid-blooming (Jun-Jul) period",-1,{"$f":"BeeVegInputData!M159","v":10},{"$f":"+IF(E73=-1,F73,E73)","v":10}]
[null,null,14,"Number of different flowering plants present during late-blooming (Aug-Jan) period",-1,{"$f":"+BeeVegInputData!N159","v":7},7]
[null,null,15,"Estimated surface area of flowering plants present during early-blooming (Feb-May) period",-1,{"$f":"(MAX(G75:H75))/(F$14)","v":0},{"$f":"IF((BeeVegInputData!E159<=BeeVegInputData!I159),(BeeVegInputData!E159),(BeeVegInputData!I159))","v":0},{"$f":"IF((BeeVegInputData!E159>BeeVegInputData!I159),(BeeVegInputData!E159),(BeeVegInputData!I159))","v":0},{"$f":"+IF(E75=-1,F75,E75)","v":0},"Enter nothing here. These values will automatically be entered from the BeeVegInputData worksheet. Enter data in to that worksheet.",null,null,"If using the BeeVegInputData worksheet, minimum and maximum values are pulled from this worksheet into Columns G and H (square meters); then the maximum of these two values is converted into a percentage of the total Map Unit in Column F. "]
[null,null,16,"Estimated surface area of flowering plants present during mid-blooming (Jun-Jul) period",-1,{"$f":"(MAX(G76:H76))/(F$14)","v":0},{"$f":"IF((BeeVegInputData!F159<=BeeVegInputData!J159),(BeeVegInputData!F159),(BeeVegInputData!J159))","v":0},{"$f":"IF((BeeVegInputData!F159>BeeVegInputData!J159),(BeeVegInputData!F159),(BeeVegInputData!J159))","v":0},{"$f":"+IF(E76=-1,F76,E76)","v":0}]
[null,null,17,"Estimated surface area of flowering plants present during late-blooming (Aug-Jan) period",-1,{"$f":"(MAX(G77:H77))/(F$14)","v":0},{"$f":"IF((BeeVegInputData!G159<=BeeVegInputData!K159),(BeeVegInputData!G159),(BeeVegInputData!K159))","v":0},{"$f":"IF((BeeVegInputData!G159>BeeVegInputData!K159),(BeeVegInputData!G159),(BeeVegInputData!K159))","v":0},{"$f":"+IF(E77=-1,F77,E77)","v":0}]
[null,"Nesting Resources",18,"Percent cover of friable bare ground present",{"$f":"IF(MAX(F78:G78)>=0.3,0.3,(AVERAGE(F78:G78)))","v":5.5E-2},0.01,0.1,"Enter percent cover range min and max values (0, 1-10, 11-20, 21-30, 31-100) in Columns F and G.",null,null,null,null,"Target is 10-30% ('30')"]
[null,null,19,"Number of rodent holes present",1,null,null,"Enter count bins ('0' for none, '1' for few [1-10], and '2' for many [>10]) in Column E. ",null,null,null,null,"Target is few or many.  For model, combine rodent holes/bunchgrasses."]
[null,null,20,"Amount of bunch grasses present",1," "," ","Enter percent cover bin in Column E: '0' for 0%, '1' for 1 to 5%, and '2' for greater than or equal to 5%. ",null,null,null,null,"Target is 5-25.  For model rodent holes/bunchgrasses are combined."]
[null,null,{"$f":"CONCATENATE(C79,\" and \",C80)","v":"19 and 20"},"Amount of rodent holes and/or bunch grasses",{"$f":"IF((E79=2),2,(IF((E80=2),2,(IF((E79=1),1,(IF((E80=1),1,0)))))))","v":1},null,null,"Calculation cell to combine rodent holes with bunch grasses.  ",null,null,null,null,"Target is few or many."]
[null,null,21,"Amount of snags/stumps present",1,null,null,"Enter count bins ('0' for none, '1' for few [1-10], and '2' for many [>10]) in Column E. ",null,null,null,null,"Target is few or many.  For model, combine snags/nest boxes/pithy."]
[null,null,22,"Amount of nest boxes or nest bundles present",0,null,null,"In Column E, enter count bins ('0' for none, '0.5' for few [1-3] that are close and/or not maintained, '1' for few [1-3]) that are >50 holes or maintained, '1.5' for few [1-3] that are both >50 holes and maintained, '2' for many [>3] that are both >50 holes and maintained.  Give an extra point for multiple sized holes and/or small blocks w/less than 20 holes. Maximum is 3.",null,null,null,null,"Target many, maintained, etc..  For model, combine snags/nest boxes/pithy."]
[null,null,23,"Amount of plants with pithy tissue present",1," "," ","Total for percent cover for all relevant species documented, then in Column E, enter appropriate bin for total percent cover range:  enter '0' for <1%, enter '1' for 1 to 5%, and enter '2' for over 5%.",null,null,null,null,"Target is 5-25.  For model, combine snags/nest boxes/pithy."]
[null,null,{"$f":"CONCATENATE(C82,\", \",C83,\" and \",C84)","v":"21, 22 and 23"},"Amount of snags/stumps, nest boxes/bundles, pithy tissue",{"$f":"IF((E82=2),2,(IF((E83>=2),2,(IF((E84=2),2,(IF((E82=1),1,(IF((E83=1.5),1,(IF((E83=1),1,(IF((E84=1),1,0)))))))))))))","v":1},null,null,"Calculation cell to combine snags/stumps, nest boxes/bundles, and pithy tissue.  ",null,null,null,null,"Target is few or many."]
[null,null,{"$f":"CONCATENATE(C78,\" through \",C84)","v":"18 through 23"},"Diversity of available nesting materials",{"$f":"((IF(E78>0.09,1,0))+(IF(E81>0,1,0))+(IF(E85>0,1,0)))/3","v":0.66666666666666663},null,null,"Calculation cell.  Treat questions 8-10 separately and 11-13 combined (e.g., if a site has snags, nest boxes, or plants with pithy tissues, it counts towards the site diversity).",null,null,null,null,"Target is 1.0"]
[null,"Management: Soil disturbance",24,"Is the Map Unit tilled at some point during the year?",1,null,null,"In Column E, enter '1' for Yes or a '0' for No.",null,null,null,null,"0 is good"]
[null,null,25,"Is the Map Unit flood-irrigated at some point during the year?",0,null,null,"In Column E, enter '1' for Yes or a '0' for No.",null,null,null,null,"0 is good"]
[null,null,26,"Is plastic mulching used at the Map Unit?",1,null,null,"In Column E, enter '1' for Yes or a '0' for No.",null,null,null,null,"0 is good"]
[null,null,27,"Does road-grading or road-making occur on the Map Unit?",1,null,null,"In Column E, enter '1' for Yes or a '0' for No.",null,null,null,null,"0 is good"]
[null,null,28,"Total percent cover of the Map Unit that experiences any soil disturbance",{"$f":"MAX(F91:G91)","v":0.6},0.3,0.6,"Enter the percent cover inclusive of all types of soil disturbance min and max values (0, 1-10, 10-30, 30-60, 60-90, 90-100) in Columns F and G.",null,null,null,null,"0 is good"]
[null,"Management: Vegetation/ground disturbance",29,"Total cover of invasive noxious weeds",{"$f":"MAX(F92:G92)","v":0},0,0,"Enter total percent cover combined for all invasive noxious weeds documented min and max values (0, 0-1, 1-5, 5-25, 25-50, 50-75, 75-95, 95-100) in Columns F and G.",null,null,null,null,"0 is good"]
[null,null,30,"Number of invasive noxious weed species",5,null,null,"Enter count in Column E.  If there are 5 or more species, enter '5'.",null,null,null,null,"0 is good"]
[null,null,31,"Percent of the Map Unit burned during the blooming season (Feb through Sept)",{"$f":"MAX(F94:G94)","v":0},0,0,"Enter percent cover range min and max values (0, 1-10, 10-30, 30-60, 60-90, 90-100) in Columns F and G.",null,null,null,null,"0 is good"]
[null,null,32,"Percent of the Map Unit mowed and/or hayed during the blooming season (Feb through Sept)",{"$f":"MAX(F95:G95)","v":0.1},0.01,0.1,"Enter percent cover range min and max values (0, 1-10, 10-30, 30-60, 60-90, 90-100) in Columns F and G.",null,null,null,null,"0 is good"]
[null,null,33,"Total percent of the Map Unit burned, mowed, or hayed during the blooming season",{"$f":"MAX(F96:G96)","v":0.3},0.1,0.3,"Enter percent cover range min and max values (0, 1-10, 10-30, 30-60, 60-90, 90-100) in Columns F and G.",null,null,null,null,"0 is good"]
[]
[]
[]
[]
[]
[]
[]
[]
[]
[]
[]
[]
[]
[]
[]
[]
[]
[]
[]
[]
[]
[]
[]
[]
[]
[]
["Map Unit Number","Map Unit Information (3)",null,null,null,"Map Unit Acres:",null,{"$f":"G$14/43560","v":6.887052341597796}]
[3,"Indicator","Variable Number","Variable","Data\n","Min of range","Max of range","Explanations and Definitions",null,null,null,null,null,null,"Notes"]
[null,"Floral Resources",12,"Number of different flowering plant species present during early-blooming (Feb-May) period",-1,{"$f":"BeeVegInputData!L237","v":7},{"$f":"+IF(E125=-1,F125,E125)","v":7},"Enter nothing here. These values will be automatically entered in Columns F and G based on your entries to the BeeVegInputData worksheet. Enter data in to that worksheet (directions are at top of worksheet). ",null,null,null,null,"If there are 5 or more species, enter '5'.  If a species straddles the blooming periods, only count in a season if it straddles over half the season.  Target is 5 or more. Note that if there are any invasive weed or plants 'not beneficial to pollinators' species on the list, they do not count towards the total.  Nonnative species can count as 0.5 pts.  "]
[null,null,13,"Number of different flowering plants present during mid-blooming (Jun-Jul) period",-1,{"$f":"BeeVegInputData!M237","v":10},{"$f":"+IF(E126=-1,F126,E126)","v":10}]
[null,null,14,"Number of different flowering plants present during late-blooming (Aug-Jan) period",-1,{"$f":"+BeeVegInputData!N237","v":7},7]
[null,null,15,"Estimated surface area of flowering plants present during early-blooming (Feb-May) period",-1,{"$f":"(MAX(G128:H128))/(G$14)","v":0},{"$f":"IF((BeeVegInputData!E237<=BeeVegInputData!I237),(BeeVegInputData!E237),(BeeVegInputData!I237))","v":0},{"$f":"IF((BeeVegInputData!E237>BeeVegInputData!I237),(BeeVegInputData!E237),(BeeVegInputData!I237))","v":0},{"$f":"+IF(E128=-1,F128,E128)","v":0},"Enter nothing here. These values will automatically be entered from the BeeVegInputData worksheet. Enter data in to that worksheet.",null,null,"If using the BeeVegInputData worksheet, minimum and maximum values are pulled from this worksheet into Columns G and H (square meters); then the maximum of these two values is converted into a percentage of the total Map Unit in Column F. "]
[null,null,16,"Estimated surface area of flowering plants present during mid-blooming (Jun-Jul) period",-1,{"$f":"(MAX(G129:H129))/(G$14)","v":0},{"$f":"IF((BeeVegInputData!F237<=BeeVegInputData!J237),(BeeVegInputData!F237),(BeeVegInputData!J237))","v":0},{"$f":"IF((BeeVegInputData!F237>BeeVegInputData!J237),(BeeVegInputData!F237),(BeeVegInputData!J237))","v":0},{"$f":"+IF(E129=-1,F129,E129)","v":0}]
[null,null,17,"Estimated surface area of flowering plants present during late-blooming (Aug-Jan) period",-1,{"$f":"(MAX(G130:H130))/(G$14)","v":0},{"$f":"IF((BeeVegInputData!G237<=BeeVegInputData!K237),(BeeVegInputData!G237),(BeeVegInputData!K237))","v":0},{"$f":"IF((BeeVegInputData!G237>BeeVegInputData!K237),(BeeVegInputData!G237),(BeeVegInputData!K237))","v":0},{"$f":"+IF(E130=-1,F130,E130)","v":0}]
[null,"Nesting Resources",18,"Percent cover of friable bare ground present",{"$f":"IF(MAX(F131:G131)>=0.3,0.3,(AVERAGE(F131:G131)))","v":5.5E-2},0.01,0.1,"Enter percent cover range min and max values (0, 1-10, 11-20, 21-30, 31-100) in Columns F and G.",null,null,null,null,"Target is 10-30% ('30')"]
[null,null,19,"Number of rodent holes present",1,null,null,"Enter count bins ('0' for none, '1' for few [1-10], and '2' for many [>10]) in Column E. ",null,null,null,null,"Target is few or many.  For model, combine rodent holes/bunchgrasses."]
[null,null,20,"Amount of bunch grasses present",1," "," ","Enter percent cover bin in Column E: '0' for 0%, '1' for 1 to 5%, and '2' for greater than or equal to 5%. ",null,null,null,null,"Target is 5-25.  For model rodent holes/bunchgrasses are combined."]
[null,null,{"$f":"CONCATENATE(C132,\" and \",C133)","v":"19 and 20"},"Amount of rodent holes and/or bunch grasses",{"$f":"IF((E132=2),2,(IF((E133=2),2,(IF((E132=1),1,(IF((E133=1),1,0)))))))","v":1},null,null,"Calculation cell to combine rodent holes with bunch grasses.  ",null,null,null,null,"Target is few or many."]
[null,null,21,"Amount of snags/stumps present",1,null,null,"Enter count bins ('0' for none, '1' for few [1-10], and '2' for many [>10]) in Column E. ",null,null,null,null,"Target is few or many.  For model, combine snags/nest boxes/pithy."]
[null,null,22,"Amount of nest boxes or nest bundles present",0,null,null,"In Column E, enter count bins ('0' for none, '0.5' for few [1-3] that are close and/or not maintained, '1' for few [1-3]) that are >50 holes or maintained, '1.5' for few [1-3] that are both >50 holes and maintained, '2' for many [>3] that are both >50 holes and maintained.  Give an extra point for multiple sized holes and/or small blocks w/less than 20 holes. Maximum is 3.",null,null,null,null,"Target many, maintained, etc..  For model, combine snags/nest boxes/pithy."]
[null,null,23,"Amount of plants with pithy tissue present",1," "," ","Total for percent cover for all relevant species documented, then in Column E, enter appropriate bin for total percent cover range:  enter '0' for <1%, enter '1' for 1 to 5%, and enter '2' for over 5%.",null,null,null,null,"Target is 5-25.  For model, combine snags/nest boxes/pithy."]
[null,null,{"$f":"CONCATENATE(C135,\", \",C136,\" and \",C137)","v":"21, 22 and 23"},"Amount of snags/stumps, nest boxes/bundles, pithy tissue",{"$f":"IF((E135=2),2,(IF((E136>=2),2,(IF((E137=2),2,(IF((E135=1),1,(IF((E136=1.5),1,(IF((E136=1),1,(IF((E137=1),1,0)))))))))))))","v":1},null,null,"Calculation cell to combine snags/stumps, nest boxes/bundles, and pithy tissue.  ",null,null,null,null,"Target is few or many."]
[null,null,{"$f":"CONCATENATE(C131,\" through \",C137)","v":"18 through 23"},"Diversity of available nesting materials",{"$f":"((IF(E131>0.09,1,0))+(IF(E134>0,1,0))+(IF(E138>0,1,0)))/3","v":0.66666666666666663},null,null,"Calculation cell.  Treat questions 8-10 separately and 11-13 combined (e.g., if a site has snags, nest boxes, or plants with pithy tissues, it counts towards the site diversity).",null,null,null,null,"Target is 1.0"]
[null,"Management: Soil disturbance",24,"Is the Map Unit tilled at some point during the year?",1,null,null,"In Column E, enter '1' for Yes or a '0' for No.",null,null,null,null,"0 is good"]
[null,null,25,"Is the Map Unit flood-irrigated at some point during the year?",0,null,null,"In Column E, enter '1' for Yes or a '0' for No.",null,null,null,null,"0 is good"]
[null,null,26,"Is plastic mulching used at the Map Unit?",1,null,null,"In Column E, enter '1' for Yes or a '0' for No.",null,null,null,null,"0 is good"]
[null,null,27,"Does road-grading or road-making occur on the Map Unit?",1,null,null,"In Column E, enter '1' for Yes or a '0' for No.",null,null,null,null,"0 is good"]
[null,null,28,"Total percent cover of the Map Unit that experiences any soil disturbance",{"$f":"MAX(F144:G144)","v":0.6},0.3,0.6,"Enter the percent cover inclusive of all types of soil disturbance min and max values (0, 1-10, 10-30, 30-60, 60-90, 90-100) in Columns F and G.",null,null,null,null,"0 is good"]
[null,"Management: Vegetation/ground disturbance",29,"Total cover of invasive noxious weeds",{"$f":"MAX(F145:G145)","v":0},0,0,"Enter total percent cover combined for all invasive noxious weeds documented min and max values (0, 0-1, 1-5, 5-25, 25-50, 50-75, 75-95, 95-100) in Columns F and G.",null,null,null,null,"0 is good"]
[null,null,30,"Number of invasive noxious weed species",5,null,null,"Enter count in Column E.  If there are 5 or more species, enter '5'.",null,null,null,null,"0 is good"]
[null,null,31,"Percent of the Map Unit burned during the blooming season (Feb through Sept)",{"$f":"MAX(F147:G147)","v":0},0,0,"Enter percent cover range min and max values (0, 1-10, 10-30, 30-60, 60-90, 90-100) in Columns F and G.",null,null,null,null,"0 is good"]
[null,null,32,"Percent of the Map Unit mowed and/or hayed during the blooming season (Feb through Sept)",{"$f":"MAX(F148:G148)","v":0.1},0.01,0.1,"Enter percent cover range min and max values (0, 1-10, 10-30, 30-60, 60-90, 90-100) in Columns F and G.",null,null,null,null,"0 is good"]
[null,null,33,"Total percent of the Map Unit burned, mowed, or hayed during the blooming season",{"$f":"MAX(F149:G149)","v":0.3},0.1,0.3,"Enter percent cover range min and max values (0, 1-10, 10-30, 30-60, 60-90, 90-100) in Columns F and G.",null,null,null,null,"0 is good"]
[]
[]
[]
[]
[]
[]
[]
[]
[]
[]
[]
[]
[]
[]
[]
[]
[]
[]
[]
[]
[]
[]
[]
[]
[]
[]
["Map Unit Number","Map Unit Information (4)",null,null,null,"Map Unit Acres:",null,{"$f":"H$14/43560","v":0.4591368227731864}]
[4,"Indicator","Variable Number","Variable","Data\n","Min of range","Max of range","Explanations and Definitions",null,null,null,null,null,null,"Notes"]
[null,"Floral Resources",12,"Number of different flowering plant species present during early-blooming (Feb-May) period",-1,{"$f":"BeeVegInputData!L315","v":7},{"$f":"+IF(E178=-1,F178,E178)","v":7},"Enter nothing here. These values will be automatically entered in Columns F and G based on your entries to the BeeVegInputData worksheet. Enter data in to that worksheet (directions are at top of worksheet). ",null,null,null,null,"If there are 5 or more species, enter '5'.  If a species straddles the blooming periods, only count in a season if it straddles over half the season.  Target is 5 or more. Note that if there are any invasive weed or plants 'not beneficial to pollinators' species on the list, they do not count towards the total.  Nonnative species can count as 0.5 pts.  "]
[null,null,13,"Number of different flowering plants present during mid-blooming (Jun-Jul) period",-1,{"$f":"BeeVegInputData!M315","v":10},{"$f":"+IF(E179=-1,F179,E179)","v":10}]
[null,null,14,"Number of different flowering plants present during late-blooming (Aug-Jan) period",-1,{"$f":"+BeeVegInputData!N315","v":7},7]
[null,null,15,"Estimated surface area of flowering plants present during early-blooming (Feb-May) period",-1,{"$f":"(MAX(G181:H181))/(H$14)","v":0},{"$f":"IF((BeeVegInputData!E315<=BeeVegInputData!I315),(BeeVegInputData!E315),(BeeVegInputData!I315))","v":0},{"$f":"IF((BeeVegInputData!E315>BeeVegInputData!I315),(BeeVegInputData!E315),(BeeVegInputData!I315))","v":0},{"$f":"+IF(E181=-1,F181,E181)","v":0},"Enter nothing here. These values will automatically be entered from the BeeVegInputData worksheet. Enter data in to that worksheet.",null,null,"If using the BeeVegInputData worksheet, minimum and maximum values are pulled from this worksheet into Columns G and H (square meters); then the maximum of these two values is converted into a percentage of the total Map Unit in Column F. "]
[null,null,16,"Estimated surface area of flowering plants present during mid-blooming (Jun-Jul) period",-1,{"$f":"(MAX(G182:H182))/(H$14)","v":0},{"$f":"IF((BeeVegInputData!F315<=BeeVegInputData!J315),(BeeVegInputData!F315),(BeeVegInputData!J315))","v":0},{"$f":"IF((BeeVegInputData!F315>BeeVegInputData!J315),(BeeVegInputData!F315),(BeeVegInputData!J315))","v":0},{"$f":"+IF(E182=-1,F182,E182)","v":0}]
[null,null,17,"Estimated surface area of flowering plants present during late-blooming (Aug-Jan) period",-1,{"$f":"(MAX(G183:H183))/(H$14)","v":0},{"$f":"IF((BeeVegInputData!G315<=BeeVegInputData!K315),(BeeVegInputData!G315),(BeeVegInputData!K315))","v":0},{"$f":"IF((BeeVegInputData!G315>BeeVegInputData!K315),(BeeVegInputData!G315),(BeeVegInputData!K315))","v":0},{"$f":"+IF(E183=-1,F183,E183)","v":0}]
[null,"Nesting Resources",18,"Percent cover of friable bare ground present",{"$f":"IF(MAX(F184:G184)>=0.3,0.3,(AVERAGE(F184:G184)))","v":5.5E-2},0.01,0.1,"Enter percent cover range min and max values (0, 1-10, 11-20, 21-30, 31-100) in Columns F and G.",null,null,null,null,"Target is 10-30% ('30')"]
[null,null,19,"Number of rodent holes present",1,null,null,"Enter count bins ('0' for none, '1' for few [1-10], and '2' for many [>10]) in Column E. ",null,null,null,null,"Target is few or many.  For model, combine rodent holes/bunchgrasses."]
[null,null,20,"Amount of bunch grasses present",1," "," ","Enter percent cover bin in Column E: '0' for 0%, '1' for 1 to 5%, and '2' for greater than or equal to 5%. ",null,null,null,null,"Target is 5-25.  For model rodent holes/bunchgrasses are combined."]
[null,null,{"$f":"CONCATENATE(C185,\" and \",C186)","v":"19 and 20"},"Amount of rodent holes and/or bunch grasses",{"$f":"IF((E185=2),2,(IF((E186=2),2,(IF((E185=1),1,(IF((E186=1),1,0)))))))","v":1},null,null,"Calculation cell to combine rodent holes with bunch grasses.  ",null,null,null,null,"Target is few or many."]
[null,null,21,"Amount of snags/stumps present",1,null,null,"Enter count bins ('0' for none, '1' for few [1-10], and '2' for many [>10]) in Column E. ",null,null,null,null,"Target is few or many.  For model, combine snags/nest boxes/pithy."]
[null,null,22,"Amount of nest boxes or nest bundles present",0,null,null,"In Column E, enter count bins ('0' for none, '0.5' for few [1-3] that are close and/or not maintained, '1' for few [1-3]) that are >50 holes or maintained, '1.5' for few [1-3] that are both >50 holes and maintained, '2' for many [>3] that are both >50 holes and maintained.  Give an extra point for multiple sized holes and/or small blocks w/less than 20 holes. Maximum is 3.",null,null,null,null,"Target many, maintained, etc..  For model, combine snags/nest boxes/pithy."]
[null,null,23,"Amount of plants with pithy tissue present",1," "," ","Total for percent cover for all relevant species documented, then in Column E, enter appropriate bin for total percent cover range:  enter '0' for <1%, enter '1' for 1 to 5%, and enter '2' for over 5%.",null,null,null,null,"Target is 5-25.  For model, combine snags/nest boxes/pithy."]
[null,null,{"$f":"CONCATENATE(C188,\", \",C189,\" and \",C190)","v":"21, 22 and 23"},"Amount of snags/stumps, nest boxes/bundles, pithy tissue",{"$f":"IF((E188=2),2,(IF((E189>=2),2,(IF((E190=2),2,(IF((E188=1),1,(IF((E189=1.5),1,(IF((E189=1),1,(IF((E190=1),1,0)))))))))))))","v":1},null,null,"Calculation cell to combine snags/stumps, nest boxes/bundles, and pithy tissue.  ",null,null,null,null,"Target is few or many."]
[null,null,{"$f":"CONCATENATE(C184,\" through \",C190)","v":"18 through 23"},"Diversity of available nesting materials",{"$f":"((IF(E184>0.09,1,0))+(IF(E187>0,1,0))+(IF(E191>0,1,0)))/3","v":0.66666666666666663},null,null,"Calculation cell.  Treat questions 8-10 separately and 11-13 combined (e.g., if a site has snags, nest boxes, or plants with pithy tissues, it counts towards the site diversity).",null,null,null,null,"Target is 1.0"]
[null,"Management: Soil disturbance",24,"Is the Map Unit tilled at some point during the year?",1,null,null,"In Column E, enter '1' for Yes or a '0' for No.",null,null,null,null,"0 is good"]
[null,null,25,"Is the Map Unit flood-irrigated at some point during the year?",0,null,null,"In Column E, enter '1' for Yes or a '0' for No.",null,null,null,null,"0 is good"]
[null,null,26,"Is plastic mulching used at the Map Unit?",1,null,null,"In Column E, enter '1' for Yes or a '0' for No.",null,null,null,null,"0 is good"]
[null,null,27,"Does road-grading or road-making occur on the Map Unit?",1,null,null,"In Column E, enter '1' for Yes or a '0' for No.",null,null,null,null,"0 is good"]
[null,null,28,"Total percent cover of the Map Unit that experiences any soil disturbance",{"$f":"MAX(F197:G197)","v":0.6},0.3,0.6,"Enter the percent cover inclusive of all types of soil disturbance min and max values (0, 1-10, 10-30, 30-60, 60-90, 90-100) in Columns F and G.",null,null,null,null,"0 is good"]
[null,"Management: Vegetation/ground disturbance",29,"Total cover of invasive noxious weeds",{"$f":"MAX(F198:G198)","v":0},0,0,"Enter total percent cover combined for all invasive noxious weeds documented min and max values (0, 0-1, 1-5, 5-25, 25-50, 50-75, 75-95, 95-100) in Columns F and G.",null,null,null,null,"0 is good"]
[null,null,30,"Number of invasive noxious weed species",5,null,null,"Enter count in Column E.  If there are 5 or more species, enter '5'.",null,null,null,null,"0 is good"]
[null,null,31,"Percent of the Map Unit burned during the blooming season (Feb through Sept)",{"$f":"MAX(F200:G200)","v":0},0,0,"Enter percent cover range min and max values (0, 1-10, 10-30, 30-60, 60-90, 90-100) in Columns F and G.",null,null,null,null,"0 is good"]
[null,null,32,"Percent of the Map Unit mowed and/or hayed during the blooming season (Feb through Sept)",{"$f":"MAX(F201:G201)","v":0.1},0.01,0.1,"Enter percent cover range min and max values (0, 1-10, 10-30, 30-60, 60-90, 90-100) in Columns F and G.",null,null,null,null,"0 is good"]
[null,null,33,"Total percent of the Map Unit burned, mowed, or hayed during the blooming season",{"$f":"MAX(F202:G202)","v":0.3},0.1,0.3,"Enter percent cover range min and max values (0, 1-10, 10-30, 30-60, 60-90, 90-100) in Columns F and G.",null,null,null,null,"0 is good"]
[]
[]
[]
[]
[]
[]
[]
[]
[]
[]
[]
[]
[]
[]
[]
[]
[]
[]
[]
[]
[]
[]
[]
[]
[]
[]
["Map Unit Number","Map Unit Information (5)",null,null,null,"Map Unit Acres:",null,{"$f":"I$14/43560","v":0.4591368227731864}]
[5,"Indicator","Variable Number","Variable","Data\n","Min of range","Max of range","Explanations and Definitions",null,null,null,null,null,null,"Notes"]
[null,"Floral Resources",12,"Number of different flowering plant species present during early-blooming (Feb-May) period",-1,{"$f":"BeeVegInputData!L393","v":7},{"$f":"+IF(E231=-1,F231,E231)","v":7},"Enter nothing here. These values will be automatically entered in Columns F and G based on your entries to the BeeVegInputData worksheet. Enter data in to that worksheet (directions are at top of worksheet). ",null,null,null,null,"If there are 5 or more species, enter '5'.  If a species straddles the blooming periods, only count in a season if it straddles over half the season.  Target is 5 or more. Note that if there are any invasive weed or plants 'not beneficial to pollinators' species on the list, they do not count towards the total.  Nonnative species can count as 0.5 pts.  "]
[null,null,13,"Number of different flowering plants present during mid-blooming (Jun-Jul) period",-1,{"$f":"BeeVegInputData!M393","v":10},{"$f":"+IF(E232=-1,F232,E232)","v":10}]
[null,null,14,"Number of different flowering plants present during late-blooming (Aug-Jan) period",-1,{"$f":"+BeeVegInputData!N393","v":7},7]
[null,null,15,"Estimated surface area of flowering plants present during early-blooming (Feb-May) period",-1,{"$f":"(MAX(G234:H234))/(I$14)","v":0},{"$f":"IF((BeeVegInputData!E393<=BeeVegInputData!I393),(BeeVegInputData!E393),(BeeVegInputData!I393))","v":0},{"$f":"IF((BeeVegInputData!E393>BeeVegInputData!I393),(BeeVegInputData!E393),(BeeVegInputData!I393))","v":0},{"$f":"+IF(E234=-1,F234,E234)","v":0},"Enter nothing here. These values will automatically be entered from the BeeVegInputData worksheet. Enter data in to that worksheet.",null,null,"If using the BeeVegInputData worksheet, minimum and maximum values are pulled from this worksheet into Columns G and H (square meters); then the maximum of these two values is converted into a percentage of the total Map Unit in Column F. "]
[null,null,16,"Estimated surface area of flowering plants present during mid-blooming (Jun-Jul) period",-1,{"$f":"(MAX(G235:H235))/(I$14)","v":0},{"$f":"IF((BeeVegInputData!F393<=BeeVegInputData!J393),(BeeVegInputData!F393),(BeeVegInputData!J393))","v":0},{"$f":"IF((BeeVegInputData!F393>BeeVegInputData!J393),(BeeVegInputData!F393),(BeeVegInputData!J393))","v":0},{"$f":"+IF(E235=-1,F235,E235)","v":0}]
[null,null,17,"Estimated surface area of flowering plants present during late-blooming (Aug-Jan) period",-1,{"$f":"(MAX(G236:H236))/(I$14)","v":0},{"$f":"IF((BeeVegInputData!G393<=BeeVegInputData!K393),(BeeVegInputData!G393),(BeeVegInputData!K393))","v":0},{"$f":"IF((BeeVegInputData!G393>BeeVegInputData!K393),(BeeVegInputData!G393),(BeeVegInputData!K393))","v":0},{"$f":"+IF(E236=-1,F236,E236)","v":0}]
[null,"Nesting Resources",18,"Percent cover of friable bare ground present",{"$f":"IF(MAX(F237:G237)>=0.3,0.3,(AVERAGE(F237:G237)))","v":5.5E-2},0.01,0.1,"Enter percent cover range min and max values (0, 1-10, 11-20, 21-30, 31-100) in Columns F and G.",null,null,null,null,"Target is 10-30% ('30')"]
[null,null,19,"Number of rodent holes present",1,null,null,"Enter count bins ('0' for none, '1' for few [1-10], and '2' for many [>10]) in Column E. ",null,null,null,null,"Target is few or many.  For model, combine rodent holes/bunchgrasses."]
[null,null,20,"Amount of bunch grasses present",1," "," ","Enter percent cover bin in Column E: '0' for 0%, '1' for 1 to 5%, and '2' for greater than or equal to 5%. ",null,null,null,null,"Target is 5-25.  For model rodent holes/bunchgrasses are combined."]
[null,null,{"$f":"CONCATENATE(C238,\" and \",C239)","v":"19 and 20"},"Amount of rodent holes and/or bunch grasses",{"$f":"IF((E238=2),2,(IF((E239=2),2,(IF((E238=1),1,(IF((E239=1),1,0)))))))","v":1},null,null,"Calculation cell to combine rodent holes with bunch grasses.  ",null,null,null,null,"Target is few or many."]
[null,null,21,"Amount of snags/stumps present",1,null,null,"Enter count bins ('0' for none, '1' for few [1-10], and '2' for many [>10]) in Column E. ",null,null,null,null,"Target is few or many.  For model, combine snags/nest boxes/pithy."]
[null,null,22,"Amount of nest boxes or nest bundles present",0,null,null,"In Column E, enter count bins ('0' for none, '0.5' for few [1-3] that are close and/or not maintained, '1' for few [1-3]) that are >50 holes or maintained, '1.5' for few [1-3] that are both >50 holes and maintained, '2' for many [>3] that are both >50 holes and maintained.  Give an extra point for multiple sized holes and/or small blocks w/less than 20 holes. Maximum is 3.",null,null,null,null,"Target many, maintained, etc..  For model, combine snags/nest boxes/pithy."]
[null,null,23,"Amount of plants with pithy tissue present",1," "," ","Total for percent cover for all relevant species documented, then in Column E, enter appropriate bin for total percent cover range:  enter '0' for <1%, enter '1' for 1 to 5%, and enter '2' for over 5%.",null,null,null,null,"Target is 5-25.  For model, combine snags/nest boxes/pithy."]
[null,null,{"$f":"CONCATENATE(C241,\", \",C242,\" and \",C243)","v":"21, 22 and 23"},"Amount of snags/stumps, nest boxes/bundles, pithy tissue",{"$f":"IF((E241=2),2,(IF((E242>=2),2,(IF((E243=2),2,(IF((E241=1),1,(IF((E242=1.5),1,(IF((E242=1),1,(IF((E243=1),1,0)))))))))))))","v":1},null,null,"Calculation cell to combine snags/stumps, nest boxes/bundles, and pithy tissue.  ",null,null,null,null,"Target is few or many."]
[null,null,{"$f":"CONCATENATE(C237,\" through \",C243)","v":"18 through 23"},"Diversity of available nesting materials",{"$f":"((IF(E237>0.09,1,0))+(IF(E240>0,1,0))+(IF(E244>0,1,0)))/3","v":0.66666666666666663},null,null,"Calculation cell.  Treat questions 8-10 separately and 11-13 combined (e.g., if a site has snags, nest boxes, or plants with pithy tissues, it counts towards the site diversity).",null,null,null,null,"Target is 1.0"]
[null,"Management: Soil disturbance",24,"Is the Map Unit tilled at some point during the year?",1,null,null,"In Column E, enter '1' for Yes or a '0' for No.",null,null,null,null,"0 is good"]
[null,null,25,"Is the Map Unit flood-irrigated at some point during the year?",0,null,null,"In Column E, enter '1' for Yes or a '0' for No.",null,null,null,null,"0 is good"]
[null,null,26,"Is plastic mulching used at the Map Unit?",1,null,null,"In Column E, enter '1' for Yes or a '0' for No.",null,null,null,null,"0 is good"]
[null,null,27,"Does road-grading or road-making occur on the Map Unit?",1,null,null,"In Column E, enter '1' for Yes or a '0' for No.",null,null,null,null,"0 is good"]
[null,null,28,"Total percent cover of the Map Unit that experiences any soil disturbance",{"$f":"MAX(F250:G250)","v":0.6},0.3,0.6,"Enter the percent cover inclusive of all types of soil disturbance min and max values (0, 1-10, 10-30, 30-60, 60-90, 90-100) in Columns F and G.",null,null,null,null,"0 is good"]
[null,"Management: Vegetation/ground disturbance",29,"Total cover of invasive noxious weeds",{"$f":"MAX(F251:G251)","v":0},0,0,"Enter total percent cover combined for all invasive noxious weeds documented min and max values (0, 0-1, 1-5, 5-25, 25-50, 50-75, 75-95, 95-100) in Columns F and G.",null,null,null,null,"0 is good"]
[null,null,30,"Number of invasive noxious weed species",5,null,null,"Enter count in Column E.  If there are 5 or more species, enter '5'.",null,null,null,null,"0 is good"]
[null,null,31,"Percent of the Map Unit burned during the blooming season (Feb through Sept)",{"$f":"MAX(F253:G253)","v":0},0,0,"Enter percent cover range min and max values (0, 1-10, 10-30, 30-60, 60-90, 90-100) in Columns F and G.",null,null,null,null,"0 is good"]
[null,null,32,"Percent of the Map Unit mowed and/or hayed during the blooming season (Feb through Sept)",{"$f":"MAX(F254:G254)","v":0.1},0.01,0.1,"Enter percent cover range min and max values (0, 1-10, 10-30, 30-60, 60-90, 90-100) in Columns F and G.",null,null,null,null,"0 is good"]
[null,null,33,"Total percent of the Map Unit burned, mowed, or hayed during the blooming season",{"$f":"MAX(F255:G255)","v":0.3},0.1,0.3,"Enter percent cover range min and max values (0, 1-10, 10-30, 30-60, 60-90, 90-100) in Columns F and G.",null,null,null,null,"0 is good"]
[]
[]
[]
[]
[]
[]
[]
[]
[]
[]
[]
[]
[]
[]
[]
[]
[]
[]
[]
[]
[]
[]
[]
[]
[]
[]
["Map Unit Number","Map Unit Information (6)",null,null,null,"Map Unit Acres:",null,{"$f":"J$14/43560","v":0.4591368227731864}]
[6,"Indicator","Variable Number","Variable","Data\n","Min of range","Max of range","Explanations and Definitions",null,null,null,null,null,null,"Notes"]
[null,"Floral Resources",12,"Number of different flowering plant species present during early-blooming (Feb-May) period",-1,{"$f":"BeeVegInputData!L471","v":7},{"$f":"+IF(E284=-1,F284,E284)","v":7},"Enter nothing here. These values will be automatically entered in Columns F and G based on your entries to the BeeVegInputData worksheet. Enter data in to that worksheet (directions are at top of worksheet). ",null,null,null,null,"If there are 5 or more species, enter '5'.  If a species straddles the blooming periods, only count in a season if it straddles over half the season.  Target is 5 or more. Note that if there are any invasive weed or plants 'not beneficial to pollinators' species on the list, they do not count towards the total.  Nonnative species can count as 0.5 pts.  "]
[null,null,13,"Number of different flowering plants present during mid-blooming (Jun-Jul) period",-1,{"$f":"BeeVegInputData!M471","v":10},{"$f":"+IF(E285=-1,F285,E285)","v":10}]
[null,null,14,"Number of different flowering plants present during late-blooming (Aug-Jan) period",-1,{"$f":"+BeeVegInputData!N471","v":7},7]
[null,null,15,"Estimated surface area of flowering plants present during early-blooming (Feb-May) period",-1,{"$f":"(MAX(G287:H287))/(J$14)","v":0},{"$f":"IF((BeeVegInputData!E471<=BeeVegInputData!I471),(BeeVegInputData!E471),(BeeVegInputData!I471))","v":0},{"$f":"IF((BeeVegInputData!E471>BeeVegInputData!I471),(BeeVegInputData!E471),(BeeVegInputData!I471))","v":0},{"$f":"+IF(E287=-1,F287,E287)","v":0},"Enter nothing here. These values will automatically be entered from the BeeVegInputData worksheet. Enter data in to that worksheet.",null,null,"If using the BeeVegInputData worksheet, minimum and maximum values are pulled from this worksheet into Columns G and H (square meters); then the maximum of these two values is converted into a percentage of the total Map Unit in Column F. "]
[null,null,16,"Estimated surface area of flowering plants present during mid-blooming (Jun-Jul) period",-1,{"$f":"(MAX(G288:H288))/(J$14)","v":0},{"$f":"IF((BeeVegInputData!F471<=BeeVegInputData!J471),(BeeVegInputData!F471),(BeeVegInputData!J471))","v":0},{"$f":"IF((BeeVegInputData!F471>BeeVegInputData!J471),(BeeVegInputData!F471),(BeeVegInputData!J471))","v":0},{"$f":"+IF(E288=-1,F288,E288)","v":0}]
[null,null,17,"Estimated surface area of flowering plants present during late-blooming (Aug-Jan) period",-1,{"$f":"(MAX(G289:H289))/(J$14)","v":0},{"$f":"IF((BeeVegInputData!G471<=BeeVegInputData!K471),(BeeVegInputData!G471),(BeeVegInputData!K471))","v":0},{"$f":"IF((BeeVegInputData!G471>BeeVegInputData!K471),(BeeVegInputData!G471),(BeeVegInputData!K471))","v":0},{"$f":"+IF(E289=-1,F289,E289)","v":0}]
[null,"Nesting Resources",18,"Percent cover of friable bare ground present",{"$f":"IF(MAX(F290:G290)>=0.3,0.3,(AVERAGE(F290:G290)))","v":5.5E-2},0.01,0.1,"Enter percent cover range min and max values (0, 1-10, 11-20, 21-30, 31-100) in Columns F and G.",null,null,null,null,"Target is 10-30% ('30')"]
[null,null,19,"Number of rodent holes present",1,null,null,"Enter count bins ('0' for none, '1' for few [1-10], and '2' for many [>10]) in Column E. ",null,null,null,null,"Target is few or many.  For model, combine rodent holes/bunchgrasses."]
[null,null,20,"Amount of bunch grasses present",1," "," ","Enter percent cover bin in Column E: '0' for 0%, '1' for 1 to 5%, and '2' for greater than or equal to 5%. ",null,null,null,null,"Target is 5-25.  For model rodent holes/bunchgrasses are combined."]
[null,null,{"$f":"CONCATENATE(C291,\" and \",C292)","v":"19 and 20"},"Amount of rodent holes and/or bunch grasses",{"$f":"IF((E291=2),2,(IF((E292=2),2,(IF((E291=1),1,(IF((E292=1),1,0)))))))","v":1},null,null,"Calculation cell to combine rodent holes with bunch grasses.  ",null,null,null,null,"Target is few or many."]
[null,null,21,"Amount of snags/stumps present",1,null,null,"Enter count bins ('0' for none, '1' for few [1-10], and '2' for many [>10]) in Column E. ",null,null,null,null,"Target is few or many.  For model, combine snags/nest boxes/pithy."]
[null,null,22,"Amount of nest boxes or nest bundles present",0,null,null,"In Column E, enter count bins ('0' for none, '0.5' for few [1-3] that are close and/or not maintained, '1' for few [1-3]) that are >50 holes or maintained, '1.5' for few [1-3] that are both >50 holes and maintained, '2' for many [>3] that are both >50 holes and maintained.  Give an extra point for multiple sized holes and/or small blocks w/less than 20 holes. Maximum is 3.",null,null,null,null,"Target many, maintained, etc..  For model, combine snags/nest boxes/pithy."]
[null,null,23,"Amount of plants with pithy tissue present",1," "," ","Total for percent cover for all relevant species documented, then in Column E, enter appropriate bin for total percent cover range:  enter '0' for <1%, enter '1' for 1 to 5%, and enter '2' for over 5%.",null,null,null,null,"Target is 5-25.  For model, combine snags/nest boxes/pithy."]
[null,null,{"$f":"CONCATENATE(C294,\", \",C295,\" and \",C296)","v":"21, 22 and 23"},"Amount of snags/stumps, nest boxes/bundles, pithy tissue",{"$f":"IF((E294=2),2,(IF((E295>=2),2,(IF((E296=2),2,(IF((E294=1),1,(IF((E295=1.5),1,(IF((E295=1),1,(IF((E296=1),1,0)))))))))))))","v":1},null,null,"Calculation cell to combine snags/stumps, nest boxes/bundles, and pithy tissue.  ",null,null,null,null,"Target is few or many."]
[null,null,{"$f":"CONCATENATE(C290,\" through \",C296)","v":"18 through 23"},"Diversity of available nesting materials",{"$f":"((IF(E290>0.09,1,0))+(IF(E293>0,1,0))+(IF(E297>0,1,0)))/3","v":0.66666666666666663},null,null,"Calculation cell.  Treat questions 8-10 separately and 11-13 combined (e.g., if a site has snags, nest boxes, or plants with pithy tissues, it counts towards the site diversity).",null,null,null,null,"Target is 1.0"]
[null,"Management: Soil disturbance",24,"Is the Map Unit tilled at some point during the year?",1,null,null,"In Column E, enter '1' for Yes or a '0' for No.",null,null,null,null,"0 is good"]
[null,null,25,"Is the Map Unit flood-irrigated at some point during the year?",0,null,null,"In Column E, enter '1' for Yes or a '0' for No.",null,null,null,null,"0 is good"]
[null,null,26,"Is plastic mulching used at the Map Unit?",1,null,null,"In Column E, enter '1' for Yes or a '0' for No.",null,null,null,null,"0 is good"]
[null,null,27,"Does road-grading or road-making occur on the Map Unit?",1,null,null,"In Column E, enter '1' for Yes or a '0' for No.",null,null,null,null,"0 is good"]
[null,null,28,"Total percent cover of the Map Unit that experiences any soil disturbance",{"$f":"MAX(F303:G303)","v":0.6},0.3,0.6,"Enter the percent cover inclusive of all types of soil disturbance min and max values (0, 1-10, 10-30, 30-60, 60-90, 90-100) in Columns F and G.",null,null,null,null,"0 is good"]
[null,"Management: Vegetation/ground disturbance",29,"Total cover of invasive noxious weeds",{"$f":"MAX(F304:G304)","v":0},0,0,"Enter total percent cover combined for all invasive noxious weeds documented min and max values (0, 0-1, 1-5, 5-25, 25-50, 50-75, 75-95, 95-100) in Columns F and G.",null,null,null,null,"0 is good"]
[null,null,30,"Number of invasive noxious weed species",5,null,null,"Enter count in Column E.  If there are 5 or more species, enter '5'.",null,null,null,null,"0 is good"]
[null,null,31,"Percent of the Map Unit burned during the blooming season (Feb through Sept)",{"$f":"MAX(F306:G306)","v":0},0,0,"Enter percent cover range min and max values (0, 1-10, 10-30, 30-60, 60-90, 90-100) in Columns F and G.",null,null,null,null,"0 is good"]
[null,null,32,"Percent of the Map Unit mowed and/or hayed during the blooming season (Feb through Sept)",{"$f":"MAX(F307:G307)","v":0.1},0.01,0.1,"Enter percent cover range min and max values (0, 1-10, 10-30, 30-60, 60-90, 90-100) in Columns F and G.",null,null,null,null,"0 is good"]
[null,null,33,"Total percent of the Map Unit burned, mowed, or hayed during the blooming season",{"$f":"MAX(F308:G308)","v":0.3},0.1,0.3,"Enter percent cover range min and max values (0, 1-10, 10-30, 30-60, 60-90, 90-100) in Columns F and G.",null,null,null,null,"0 is good"]
[]
[]
[]
[]
[]
[]
[]
[]
[]
[]
[]
[]
[]
[]
[]
[]
[]
[]
[]
[]
[]
[]
[]
[]
[]
[]
["Map Unit Number","Map Unit Information (7)",null,null,null,"Map Unit Acres:",null,{"$f":"K$14/43560","v":0.4591368227731864}]
[7,"Indicator","Variable Number","Variable","Data\n","Min of range","Max of range","Explanations and Definitions",null,null,null,null,null,null,"Notes"]
[null,"Floral Resources",12,"Number of different flowering plant species present during early-blooming (Feb-May) period",-1,{"$f":"BeeVegInputData!L549","v":7},{"$f":"+IF(E337=-1,F337,E337)","v":7},"Enter nothing here. These values will be automatically entered in Columns F and G based on your entries to the BeeVegInputData worksheet. Enter data in to that worksheet (directions are at top of worksheet). ",null,null,null,null,"If there are 5 or more species, enter '5'.  If a species straddles the blooming periods, only count in a season if it straddles over half the season.  Target is 5 or more. Note that if there are any invasive weed or plants 'not beneficial to pollinators' species on the list, they do not count towards the total.  Nonnative species can count as 0.5 pts.  "]
[null,null,13,"Number of different flowering plants present during mid-blooming (Jun-Jul) period",-1,{"$f":"BeeVegInputData!M549","v":10},{"$f":"+IF(E338=-1,F338,E338)","v":10}]
[null,null,14,"Number of different flowering plants present during late-blooming (Aug-Jan) period",-1,{"$f":"+BeeVegInputData!N549","v":7},7]
[null,null,15,"Estimated surface area of flowering plants present during early-blooming (Feb-May) period",-1,{"$f":"(MAX(G340:H340))/(K$14)","v":0},{"$f":"IF((BeeVegInputData!E549<=BeeVegInputData!I549),(BeeVegInputData!E549),(BeeVegInputData!I549))","v":0},{"$f":"IF((BeeVegInputData!E549>BeeVegInputData!I549),(BeeVegInputData!E549),(BeeVegInputData!I549))","v":0},{"$f":"+IF(E340=-1,F340,E340)","v":0},"Enter nothing here. These values will automatically be entered from the BeeVegInputData worksheet. Enter data in to that worksheet.",null,null,"If using the BeeVegInputData worksheet, minimum and maximum values are pulled from this worksheet into Columns G and H (square meters); then the maximum of these two values is converted into a percentage of the total Map Unit in Column F. "]
[null,null,16,"Estimated surface area of flowering plants present during mid-blooming (Jun-Jul) period",-1,{"$f":"(MAX(G341:H341))/(K$14)","v":0},{"$f":"IF((BeeVegInputData!F549<=BeeVegInputData!J549),(BeeVegInputData!F549),(BeeVegInputData!J549))","v":0},{"$f":"IF((BeeVegInputData!F549>BeeVegInputData!J549),(BeeVegInputData!F549),(BeeVegInputData!J549))","v":0},{"$f":"+IF(E341=-1,F341,E341)","v":0}]
[null,null,17,"Estimated surface area of flowering plants present during late-blooming (Aug-Jan) period",-1,{"$f":"(MAX(G342:H342))/(K$14)","v":0},{"$f":"IF((BeeVegInputData!G549<=BeeVegInputData!K549),(BeeVegInputData!G549),(BeeVegInputData!K549))","v":0},{"$f":"IF((BeeVegInputData!G549>BeeVegInputData!K549),(BeeVegInputData!G549),(BeeVegInputData!K549))","v":0},{"$f":"+IF(E342=-1,F342,E342)","v":0}]
[null,"Nesting Resources",18,"Percent cover of friable bare ground present",{"$f":"IF(MAX(F343:G343)>=0.3,0.3,(AVERAGE(F343:G343)))","v":5.5E-2},0.01,0.1,"Enter percent cover range min and max values (0, 1-10, 11-20, 21-30, 31-100) in Columns F and G.",null,null,null,null,"Target is 10-30% ('30')"]
[null,null,19,"Number of rodent holes present",1,null,null,"Enter count bins ('0' for none, '1' for few [1-10], and '2' for many [>10]) in Column E. ",null,null,null,null,"Target is few or many.  For model, combine rodent holes/bunchgrasses."]
[null,null,20,"Amount of bunch grasses present",1," "," ","Enter percent cover bin in Column E: '0' for 0%, '1' for 1 to 5%, and '2' for greater than or equal to 5%. ",null,null,null,null,"Target is 5-25.  For model rodent holes/bunchgrasses are combined."]
[null,null,{"$f":"CONCATENATE(C344,\" and \",C345)","v":"19 and 20"},"Amount of rodent holes and/or bunch grasses",{"$f":"IF((E344=2),2,(IF((E345=2),2,(IF((E344=1),1,(IF((E345=1),1,0)))))))","v":1},null,null,"Calculation cell to combine rodent holes with bunch grasses.  ",null,null,null,null,"Target is few or many."]
[null,null,21,"Amount of snags/stumps present",1,null,null,"Enter count bins ('0' for none, '1' for few [1-10], and '2' for many [>10]) in Column E. ",null,null,null,null,"Target is few or many.  For model, combine snags/nest boxes/pithy."]
[null,null,22,"Amount of nest boxes or nest bundles present",0,null,null,"In Column E, enter count bins ('0' for none, '0.5' for few [1-3] that are close and/or not maintained, '1' for few [1-3]) that are >50 holes or maintained, '1.5' for few [1-3] that are both >50 holes and maintained, '2' for many [>3] that are both >50 holes and maintained.  Give an extra point for multiple sized holes and/or small blocks w/less than 20 holes. Maximum is 3.",null,null,null,null,"Target many, maintained, etc..  For model, combine snags/nest boxes/pithy."]
[null,null,23,"Amount of plants with pithy tissue present",1," "," ","Total for percent cover for all relevant species documented, then in Column E, enter appropriate bin for total percent cover range:  enter '0' for <1%, enter '1' for 1 to 5%, and enter '2' for over 5%.",null,null,null,null,"Target is 5-25.  For model, combine snags/nest boxes/pithy."]
[null,null,{"$f":"CONCATENATE(C347,\", \",C348,\" and \",C349)","v":"21, 22 and 23"},"Amount of snags/stumps, nest boxes/bundles, pithy tissue",{"$f":"IF((E347=2),2,(IF((E348>=2),2,(IF((E349=2),2,(IF((E347=1),1,(IF((E348=1.5),1,(IF((E348=1),1,(IF((E349=1),1,0)))))))))))))","v":1},null,null,"Calculation cell to combine snags/stumps, nest boxes/bundles, and pithy tissue.  ",null,null,null,null,"Target is few or many."]
[null,null,{"$f":"CONCATENATE(C343,\" through \",C349)","v":"18 through 23"},"Diversity of available nesting materials",{"$f":"((IF(E343>0.09,1,0))+(IF(E346>0,1,0))+(IF(E350>0,1,0)))/3","v":0.66666666666666663},null,null,"Calculation cell.  Treat questions 8-10 separately and 11-13 combined (e.g., if a site has snags, nest boxes, or plants with pithy tissues, it counts towards the site diversity).",null,null,null,null,"Target is 1.0"]
[null,"Management: Soil disturbance",24,"Is the Map Unit tilled at some point during the year?",1,null,null,"In Column E, enter '1' for Yes or a '0' for No.",null,null,null,null,"0 is good"]
[null,null,25,"Is the Map Unit flood-irrigated at some point during the year?",0,null,null,"In Column E, enter '1' for Yes or a '0' for No.",null,null,null,null,"0 is good"]
[null,null,26,"Is plastic mulching used at the Map Unit?",1,null,null,"In Column E, enter '1' for Yes or a '0' for No.",null,null,null,null,"0 is good"]
[null,null,27,"Does road-grading or road-making occur on the Map Unit?",1,null,null,"In Column E, enter '1' for Yes or a '0' for No.",null,null,null,null,"0 is good"]
[null,null,28,"Total percent cover of the Map Unit that experiences any soil disturbance",{"$f":"MAX(F356:G356)","v":0.6},0.3,0.6,"Enter the percent cover inclusive of all types of soil disturbance min and max values (0, 1-10, 10-30, 30-60, 60-90, 90-100) in Columns F and G.",null,null,null,null,"0 is good"]
[null,"Management: Vegetation/ground disturbance",29,"Total cover of invasive noxious weeds",{"$f":"MAX(F357:G357)","v":0},0,0,"Enter total percent cover combined for all invasive noxious weeds documented min and max values (0, 0-1, 1-5, 5-25, 25-50, 50-75, 75-95, 95-100) in Columns F and G.",null,null,null,null,"0 is good"]
[null,null,30,"Number of invasive noxious weed species",5,null,null,"Enter count in Column E.  If there are 5 or more species, enter '5'.",null,null,null,null,"0 is good"]
[null,null,31,"Percent of the Map Unit burned during the blooming season (Feb through Sept)",{"$f":"MAX(F359:G359)","v":0},0,0,"Enter percent cover range min and max values (0, 1-10, 10-30, 30-60, 60-90, 90-100) in Columns F and G.",null,null,null,null,"0 is good"]
[null,null,32,"Percent of the Map Unit mowed and/or hayed during the blooming season (Feb through Sept)",{"$f":"MAX(F360:G360)","v":0.1},0.01,0.1,"Enter percent cover range min and max values (0, 1-10, 10-30, 30-60, 60-90, 90-100) in Columns F and G.",null,null,null,null,"0 is good"]
[null,null,33,"Total percent of the Map Unit burned, mowed, or hayed during the blooming season",{"$f":"MAX(F361:G361)","v":0.3},0.1,0.3,"Enter percent cover range min and max values (0, 1-10, 10-30, 30-60, 60-90, 90-100) in Columns F and G.",null,null,null,null,"0 is good"]
[]
[]
[]
[]
[]
[]
[]
[]
[]
[]
[]
[]
[]
[]
[]
[]
[]
[]
[]
[]
[]
[]
[]
[]
[]
[]
["Map Unit Number","Map Unit Information (8)",null,null,null,"Map Unit Acres:",null,{"$f":"L$14/43560","v":0.4591368227731864}]
[8,"Indicator","Variable Number","Variable","Data\n","Min of range","Max of range","Explanations and Definitions",null,null,null,null,null,null,"Notes"]
[null,"Floral Resources",12,"Number of different flowering plant species present during early-blooming (Feb-May) period",-1,{"$f":"BeeVegInputData!L627","v":7},{"$f":"+IF(E390=-1,F390,E390)","v":7},"Enter nothing here. These values will be automatically entered in Columns F and G based on your entries to the BeeVegInputData worksheet. Enter data in to that worksheet (directions are at top of worksheet). ",null,null,null,null,"If there are 5 or more species, enter '5'.  If a species straddles the blooming periods, only count in a season if it straddles over half the season.  Target is 5 or more. Note that if there are any invasive weed or plants 'not beneficial to pollinators' species on the list, they do not count towards the total.  Nonnative species can count as 0.5 pts.  "]
[null,null,13,"Number of different flowering plants present during mid-blooming (Jun-Jul) period",-1,{"$f":"BeeVegInputData!M627","v":10},{"$f":"+IF(E391=-1,F391,E391)","v":10}]
[null,null,14,"Number of different flowering plants present during late-blooming (Aug-Jan) period",-1,{"$f":"+BeeVegInputData!N627","v":7},7]
[null,null,15,"Estimated surface area of flowering plants present during early-blooming (Feb-May) period",-1,{"$f":"(MAX(G393:H393))/(L$14)","v":0},{"$f":"IF((BeeVegInputData!E627<=BeeVegInputData!I627),(BeeVegInputData!E627),(BeeVegInputData!I627))","v":0},{"$f":"IF((BeeVegInputData!E627>BeeVegInputData!I627),(BeeVegInputData!E627),(BeeVegInputData!I627))","v":0},{"$f":"+IF(E393=-1,F393,E393)","v":0},"Enter nothing here. These values will automatically be entered from the BeeVegInputData worksheet. Enter data in to that worksheet.",null,null,"If using the BeeVegInputData worksheet, minimum and maximum values are pulled from this worksheet into Columns G and H (square meters); then the maximum of these two values is converted into a percentage of the total Map Unit in Column F. "]
[null,null,16,"Estimated surface area of flowering plants present during mid-blooming (Jun-Jul) period",-1,{"$f":"(MAX(G394:H394))/(L$14)","v":0},{"$f":"IF((BeeVegInputData!F627<=BeeVegInputData!J627),(BeeVegInputData!F627),(BeeVegInputData!J627))","v":0},{"$f":"IF((BeeVegInputData!F627>BeeVegInputData!J627),(BeeVegInputData!F627),(BeeVegInputData!J627))","v":0},{"$f":"+IF(E394=-1,F394,E394)","v":0}]
[null,null,17,"Estimated surface area of flowering plants present during late-blooming (Aug-Jan) period",-1,{"$f":"(MAX(G395:H395))/(L$14)","v":0},{"$f":"IF((BeeVegInputData!G627<=BeeVegInputData!K627),(BeeVegInputData!G627),(BeeVegInputData!K627))","v":0},{"$f":"IF((BeeVegInputData!G627>BeeVegInputData!K627),(BeeVegInputData!G627),(BeeVegInputData!K627))","v":0},{"$f":"+IF(E395=-1,F395,E395)","v":0}]
[null,"Nesting Resources",18,"Percent cover of friable bare ground present",{"$f":"IF(MAX(F396:G396)>=0.3,0.3,(AVERAGE(F396:G396)))","v":5.5E-2},0.01,0.1,"Enter percent cover range min and max values (0, 1-10, 11-20, 21-30, 31-100) in Columns F and G.",null,null,null,null,"Target is 10-30% ('30')"]
[null,null,19,"Number of rodent holes present",1,null,null,"Enter count bins ('0' for none, '1' for few [1-10], and '2' for many [>10]) in Column E. ",null,null,null,null,"Target is few or many.  For model, combine rodent holes/bunchgrasses."]
[null,null,20,"Amount of bunch grasses present",1," "," ","Enter percent cover bin in Column E: '0' for 0%, '1' for 1 to 5%, and '2' for greater than or equal to 5%. ",null,null,null,null,"Target is 5-25.  For model rodent holes/bunchgrasses are combined."]
[null,null,{"$f":"CONCATENATE(C397,\" and \",C398)","v":"19 and 20"},"Amount of rodent holes and/or bunch grasses",{"$f":"IF((E397=2),2,(IF((E398=2),2,(IF((E397=1),1,(IF((E398=1),1,0)))))))","v":1},null,null,"Calculation cell to combine rodent holes with bunch grasses.  ",null,null,null,null,"Target is few or many."]
[null,null,21,"Amount of snags/stumps present",1,null,null,"Enter count bins ('0' for none, '1' for few [1-10], and '2' for many [>10]) in Column E. ",null,null,null,null,"Target is few or many.  For model, combine snags/nest boxes/pithy."]
[null,null,22,"Amount of nest boxes or nest bundles present",0,null,null,"In Column E, enter count bins ('0' for none, '0.5' for few [1-3] that are close and/or not maintained, '1' for few [1-3]) that are >50 holes or maintained, '1.5' for few [1-3] that are both >50 holes and maintained, '2' for many [>3] that are both >50 holes and maintained.  Give an extra point for multiple sized holes and/or small blocks w/less than 20 holes. Maximum is 3.",null,null,null,null,"Target many, maintained, etc..  For model, combine snags/nest boxes/pithy."]
[null,null,23,"Amount of plants with pithy tissue present",1," "," ","Total for percent cover for all relevant species documented, then in Column E, enter appropriate bin for total percent cover range:  enter '0' for <1%, enter '1' for 1 to 5%, and enter '2' for over 5%.",null,null,null,null,"Target is 5-25.  For model, combine snags/nest boxes/pithy."]
[null,null,{"$f":"CONCATENATE(C400,\", \",C401,\" and \",C402)","v":"21, 22 and 23"},"Amount of snags/stumps, nest boxes/bundles, pithy tissue",{"$f":"IF((E400=2),2,(IF((E401>=2),2,(IF((E402=2),2,(IF((E400=1),1,(IF((E401=1.5),1,(IF((E401=1),1,(IF((E402=1),1,0)))))))))))))","v":1},null,null,"Calculation cell to combine snags/stumps, nest boxes/bundles, and pithy tissue.  ",null,null,null,null,"Target is few or many."]
[null,null,{"$f":"CONCATENATE(C396,\" through \",C402)","v":"18 through 23"},"Diversity of available nesting materials",{"$f":"((IF(E396>0.09,1,0))+(IF(E399>0,1,0))+(IF(E403>0,1,0)))/3","v":0.66666666666666663},null,null,"Calculation cell.  Treat questions 8-10 separately and 11-13 combined (e.g., if a site has snags, nest boxes, or plants with pithy tissues, it counts towards the site diversity).",null,null,null,null,"Target is 1.0"]
[null,"Management: Soil disturbance",24,"Is the Map Unit tilled at some point during the year?",1,null,null,"In Column E, enter '1' for Yes or a '0' for No.",null,null,null,null,"0 is good"]
[null,null,25,"Is the Map Unit flood-irrigated at some point during the year?",0,null,null,"In Column E, enter '1' for Yes or a '0' for No.",null,null,null,null,"0 is good"]
[null,null,26,"Is plastic mulching used at the Map Unit?",1,null,null,"In Column E, enter '1' for Yes or a '0' for No.",null,null,null,null,"0 is good"]
[null,null,27,"Does road-grading or road-making occur on the Map Unit?",1,null,null,"In Column E, enter '1' for Yes or a '0' for No.",null,null,null,null,"0 is good"]
[null,null,28,"Total percent cover of the Map Unit that experiences any soil disturbance",{"$f":"MAX(F409:G409)","v":0.6},0.3,0.6,"Enter the percent cover inclusive of all types of soil disturbance min and max values (0, 1-10, 10-30, 30-60, 60-90, 90-100) in Columns F and G.",null,null,null,null,"0 is good"]
[null,"Management: Vegetation/ground disturbance",29,"Total cover of invasive noxious weeds",{"$f":"MAX(F410:G410)","v":0},0,0,"Enter total percent cover combined for all invasive noxious weeds documented min and max values (0, 0-1, 1-5, 5-25, 25-50, 50-75, 75-95, 95-100) in Columns F and G.",null,null,null,null,"0 is good"]
[null,null,30,"Number of invasive noxious weed species",5,null,null,"Enter count in Column E.  If there are 5 or more species, enter '5'.",null,null,null,null,"0 is good"]
[null,null,31,"Percent of the Map Unit burned during the blooming season (Feb through Sept)",{"$f":"MAX(F412:G412)","v":0},0,0,"Enter percent cover range min and max values (0, 1-10, 10-30, 30-60, 60-90, 90-100) in Columns F and G.",null,null,null,null,"0 is good"]
[null,null,32,"Percent of the Map Unit mowed and/or hayed during the blooming season (Feb through Sept)",{"$f":"MAX(F413:G413)","v":0.1},0.01,0.1,"Enter percent cover range min and max values (0, 1-10, 10-30, 30-60, 60-90, 90-100) in Columns F and G.",null,null,null,null,"0 is good"]
[null,null,33,"Total percent of the Map Unit burned, mowed, or hayed during the blooming season",{"$f":"MAX(F414:G414)","v":0.3},0.1,0.3,"Enter percent cover range min and max values (0, 1-10, 10-30, 30-60, 60-90, 90-100) in Columns F and G.",null,null,null,null,"0 is good"]
[]
[]
[]
[]
[]
[]
[]
[]
[]
[]
[]
[]
[]
[]
[]
[]
[]
[]
[]
[]
[]
[]
[]
[]
[]
[]
["Map Unit Number","Map Unit Information (9)",null,null,null,"Map Unit Acres:",null,{"$f":"M$14/43560","v":0.4591368227731864}]
[9,"Indicator","Variable Number","Variable","Data\n","Min of range","Max of range","Explanations and Definitions",null,null,null,null,null,null,"Notes"]
[null,"Floral Resources",12,"Number of different flowering plant species present during early-blooming (Feb-May) period",-1,{"$f":"BeeVegInputData!L705","v":7},{"$f":"+IF(E443=-1,F443,E443)","v":7},"Enter nothing here. These values will be automatically entered in Columns F and G based on your entries to the BeeVegInputData worksheet. Enter data in to that worksheet (directions are at top of worksheet). ",null,null,null,null,"If there are 5 or more species, enter '5'.  If a species straddles the blooming periods, only count in a season if it straddles over half the season.  Target is 5 or more. Note that if there are any invasive weed or plants 'not beneficial to pollinators' species on the list, they do not count towards the total.  Nonnative species can count as 0.5 pts.  "]
[null,null,13,"Number of different flowering plants present during mid-blooming (Jun-Jul) period",-1,{"$f":"BeeVegInputData!M705","v":10},{"$f":"+IF(E444=-1,F444,E444)","v":10}]
[null,null,14,"Number of different flowering plants present during late-blooming (Aug-Jan) period",-1,{"$f":"+BeeVegInputData!N705","v":7},7]
[null,null,15,"Estimated surface area of flowering plants present during early-blooming (Feb-May) period",-1,{"$f":"(MAX(G446:H446))/(M$14)","v":0},{"$f":"IF((BeeVegInputData!E705<=BeeVegInputData!I705),(BeeVegInputData!E705),(BeeVegInputData!I705))","v":0},{"$f":"IF((BeeVegInputData!E705>BeeVegInputData!I705),(BeeVegInputData!E705),(BeeVegInputData!I705))","v":0},{"$f":"+IF(E446=-1,F446,E446)","v":0},"Enter nothing here. These values will automatically be entered from the BeeVegInputData worksheet. Enter data in to that worksheet.",null,null,"If using the BeeVegInputData worksheet, minimum and maximum values are pulled from this worksheet into Columns G and H (square meters); then the maximum of these two values is converted into a percentage of the total Map Unit in Column F. "]
[null,null,16,"Estimated surface area of flowering plants present during mid-blooming (Jun-Jul) period",-1,{"$f":"(MAX(G447:H447))/(M$14)","v":0},{"$f":"IF((BeeVegInputData!F705<=BeeVegInputData!J705),(BeeVegInputData!F705),(BeeVegInputData!J705))","v":0},{"$f":"IF((BeeVegInputData!F705>BeeVegInputData!J705),(BeeVegInputData!F705),(BeeVegInputData!J705))","v":0},{"$f":"+IF(E447=-1,F447,E447)","v":0}]
[null,null,17,"Estimated surface area of flowering plants present during late-blooming (Aug-Jan) period",-1,{"$f":"(MAX(G448:H448))/(M$14)","v":0},{"$f":"IF((BeeVegInputData!G705<=BeeVegInputData!K705),(BeeVegInputData!G705),(BeeVegInputData!K705))","v":0},{"$f":"IF((BeeVegInputData!G705>BeeVegInputData!K705),(BeeVegInputData!G705),(BeeVegInputData!K705))","v":0},{"$f":"+IF(E448=-1,F448,E448)","v":0}]
[null,"Nesting Resources",18,"Percent cover of friable bare ground present",{"$f":"IF(MAX(F449:G449)>=0.3,0.3,(AVERAGE(F449:G449)))","v":5.5E-2},0.01,0.1,"Enter percent cover range min and max values (0, 1-10, 11-20, 21-30, 31-100) in Columns F and G.",null,null,null,null,"Target is 10-30% ('30')"]
[null,null,19,"Number of rodent holes present",1,null,null,"Enter count bins ('0' for none, '1' for few [1-10], and '2' for many [>10]) in Column E. ",null,null,null,null,"Target is few or many.  For model, combine rodent holes/bunchgrasses."]
[null,null,20,"Amount of bunch grasses present",1," "," ","Enter percent cover bin in Column E: '0' for 0%, '1' for 1 to 5%, and '2' for greater than or equal to 5%. ",null,null,null,null,"Target is 5-25.  For model rodent holes/bunchgrasses are combined."]
[null,null,{"$f":"CONCATENATE(C450,\" and \",C451)","v":"19 and 20"},"Amount of rodent holes and/or bunch grasses",{"$f":"IF((E450=2),2,(IF((E451=2),2,(IF((E450=1),1,(IF((E451=1),1,0)))))))","v":1},null,null,"Calculation cell to combine rodent holes with bunch grasses.  ",null,null,null,null,"Target is few or many."]
[null,null,21,"Amount of snags/stumps present",1,null,null,"Enter count bins ('0' for none, '1' for few [1-10], and '2' for many [>10]) in Column E. ",null,null,null,null,"Target is few or many.  For model, combine snags/nest boxes/pithy."]
[null,null,22,"Amount of nest boxes or nest bundles present",0,null,null,"In Column E, enter count bins ('0' for none, '0.5' for few [1-3] that are close and/or not maintained, '1' for few [1-3]) that are >50 holes or maintained, '1.5' for few [1-3] that are both >50 holes and maintained, '2' for many [>3] that are both >50 holes and maintained.  Give an extra point for multiple sized holes and/or small blocks w/less than 20 holes. Maximum is 3.",null,null,null,null,"Target many, maintained, etc..  For model, combine snags/nest boxes/pithy."]
[null,null,23,"Amount of plants with pithy tissue present",1," "," ","Total for percent cover for all relevant species documented, then in Column E, enter appropriate bin for total percent cover range:  enter '0' for <1%, enter '1' for 1 to 5%, and enter '2' for over 5%.",null,null,null,null,"Target is 5-25.  For model, combine snags/nest boxes/pithy."]
[null,null,{"$f":"CONCATENATE(C453,\", \",C454,\" and \",C455)","v":"21, 22 and 23"},"Amount of snags/stumps, nest boxes/bundles, pithy tissue",{"$f":"IF((E453=2),2,(IF((E454>=2),2,(IF((E455=2),2,(IF((E453=1),1,(IF((E454=1.5),1,(IF((E454=1),1,(IF((E455=1),1,0)))))))))))))","v":1},null,null,"Calculation cell to combine snags/stumps, nest boxes/bundles, and pithy tissue.  ",null,null,null,null,"Target is few or many."]
[null,null,{"$f":"CONCATENATE(C449,\" through \",C455)","v":"18 through 23"},"Diversity of available nesting materials",{"$f":"((IF(E449>0.09,1,0))+(IF(E452>0,1,0))+(IF(E456>0,1,0)))/3","v":0.66666666666666663},null,null,"Calculation cell.  Treat questions 8-10 separately and 11-13 combined (e.g., if a site has snags, nest boxes, or plants with pithy tissues, it counts towards the site diversity).",null,null,null,null,"Target is 1.0"]
[null,"Management: Soil disturbance",24,"Is the Map Unit tilled at some point during the year?",1,null,null,"In Column E, enter '1' for Yes or a '0' for No.",null,null,null,null,"0 is good"]
[null,null,25,"Is the Map Unit flood-irrigated at some point during the year?",0,null,null,"In Column E, enter '1' for Yes or a '0' for No.",null,null,null,null,"0 is good"]
[null,null,26,"Is plastic mulching used at the Map Unit?",1,null,null,"In Column E, enter '1' for Yes or a '0' for No.",null,null,null,null,"0 is good"]
[null,null,27,"Does road-grading or road-making occur on the Map Unit?",1,null,null,"In Column E, enter '1' for Yes or a '0' for No.",null,null,null,null,"0 is good"]
[null,null,28,"Total percent cover of the Map Unit that experiences any soil disturbance",{"$f":"MAX(F462:G462)","v":0.6},0.3,0.6,"Enter the percent cover inclusive of all types of soil disturbance min and max values (0, 1-10, 10-30, 30-60, 60-90, 90-100) in Columns F and G.",null,null,null,null,"0 is good"]
[null,"Management: Vegetation/ground disturbance",29,"Total cover of invasive noxious weeds",{"$f":"MAX(F463:G463)","v":0},0,0,"Enter total percent cover combined for all invasive noxious weeds documented min and max values (0, 0-1, 1-5, 5-25, 25-50, 50-75, 75-95, 95-100) in Columns F and G.",null,null,null,null,"0 is good"]
[null,null,30,"Number of invasive noxious weed species",5,null,null,"Enter count in Column E.  If there are 5 or more species, enter '5'.",null,null,null,null,"0 is good"]
[null,null,31,"Percent of the Map Unit burned during the blooming season (Feb through Sept)",{"$f":"MAX(F465:G465)","v":0},0,0,"Enter percent cover range min and max values (0, 1-10, 10-30, 30-60, 60-90, 90-100) in Columns F and G.",null,null,null,null,"0 is good"]
[null,null,32,"Percent of the Map Unit mowed and/or hayed during the blooming season (Feb through Sept)",{"$f":"MAX(F466:G466)","v":0.1},0.01,0.1,"Enter percent cover range min and max values (0, 1-10, 10-30, 30-60, 60-90, 90-100) in Columns F and G.",null,null,null,null,"0 is good"]
[null,null,33,"Total percent of the Map Unit burned, mowed, or hayed during the blooming season",{"$f":"MAX(F467:G467)","v":0.3},0.1,0.3,"Enter percent cover range min and max values (0, 1-10, 10-30, 30-60, 60-90, 90-100) in Columns F and G.",null,null,null,null,"0 is good"]
[]
[]
[]
[]
[]
[]
[]
[]
[]
[]
[]
[]
[]
[]
[]
[]
[]
[]
[]
[]
[]
[]
[]
[]
[]
[]
["Map Unit Number","Map Unit Information (10)",null,null,null,"Map Unit Acres:",null,{"$f":"N$14/43560","v":0.4591368227731864}]
[10,"Indicator","Variable Number","Variable","Data\n","Min of range","Max of range","Explanations and Definitions",null,null,null,null,null,null,"Notes"]
[null,"Floral Resources",12,"Number of different flowering plant species present during early-blooming (Feb-May) period",-1,{"$f":"BeeVegInputData!L783","v":7},{"$f":"+IF(E496=-1,F496,E496)","v":7},"Enter nothing here. These values will be automatically entered in Columns F and G based on your entries to the BeeVegInputData worksheet. Enter data in to that worksheet (directions are at top of worksheet). ",null,null,null,null,"If there are 5 or more species, enter '5'.  If a species straddles the blooming periods, only count in a season if it straddles over half the season.  Target is 5 or more. Note that if there are any invasive weed or plants 'not beneficial to pollinators' species on the list, they do not count towards the total.  Nonnative species can count as 0.5 pts.  "]
[null,null,13,"Number of different flowering plants present during mid-blooming (Jun-Jul) period",-1,{"$f":"BeeVegInputData!M783","v":10},{"$f":"+IF(E497=-1,F497,E497)","v":10}]
[null,null,14,"Number of different flowering plants present during late-blooming (Aug-Jan) period",-1,{"$f":"+BeeVegInputData!N783","v":7},7]
[null,null,15,"Estimated surface area of flowering plants present during early-blooming (Feb-May) period",-1,{"$f":"(MAX(G499:H499))/(N$14)","v":0},{"$f":"IF((BeeVegInputData!E783<=BeeVegInputData!I783),(BeeVegInputData!E783),(BeeVegInputData!I783))","v":0},{"$f":"IF((BeeVegInputData!E783>BeeVegInputData!I783),(BeeVegInputData!E783),(BeeVegInputData!I783))","v":0},{"$f":"+IF(E499=-1,F499,E499)","v":0},"Enter nothing here. These values will automatically be entered from the BeeVegInputData worksheet. Enter data in to that worksheet.",null,null,"If using the BeeVegInputData worksheet, minimum and maximum values are pulled from this worksheet into Columns G and H (square meters); then the maximum of these two values is converted into a percentage of the total Map Unit in Column F. "]
[null,null,16,"Estimated surface area of flowering plants present during mid-blooming (Jun-Jul) period",-1,{"$f":"(MAX(G500:H500))/(N$14)","v":0},{"$f":"IF((BeeVegInputData!F783<=BeeVegInputData!J783),(BeeVegInputData!F783),(BeeVegInputData!J783))","v":0},{"$f":"IF((BeeVegInputData!F783>BeeVegInputData!J783),(BeeVegInputData!F783),(BeeVegInputData!J783))","v":0},{"$f":"+IF(E500=-1,F500,E500)","v":0}]
[null,null,17,"Estimated surface area of flowering plants present during late-blooming (Aug-Jan) period",-1,{"$f":"(MAX(G501:H501))/(N$14)","v":0},{"$f":"IF((BeeVegInputData!G783<=BeeVegInputData!K783),(BeeVegInputData!G783),(BeeVegInputData!K783))","v":0},{"$f":"IF((BeeVegInputData!G783>BeeVegInputData!K783),(BeeVegInputData!G783),(BeeVegInputData!K783))","v":0},{"$f":"+IF(E501=-1,F501,E501)","v":0}]
[null,"Nesting Resources",18,"Percent cover of friable bare ground present",{"$f":"IF(MAX(F502:G502)>=0.3,0.3,(AVERAGE(F502:G502)))","v":5.5E-2},0.01,0.1,"Enter percent cover range min and max values (0, 1-10, 11-20, 21-30, 31-100) in Columns F and G.",null,null,null,null,"Target is 10-30% ('30')"]
[null,null,19,"Number of rodent holes present",1,null,null,"Enter count bins ('0' for none, '1' for few [1-10], and '2' for many [>10]) in Column E. ",null,null,null,null,"Target is few or many.  For model, combine rodent holes/bunchgrasses."]
[null,null,20,"Amount of bunch grasses present",1," "," ","Enter percent cover bin in Column E: '0' for 0%, '1' for 1 to 5%, and '2' for greater than or equal to 5%. ",null,null,null,null,"Target is 5-25.  For model rodent holes/bunchgrasses are combined."]
[null,null,{"$f":"CONCATENATE(C503,\" and \",C504)","v":"19 and 20"},"Amount of rodent holes and/or bunch grasses",{"$f":"IF((E503=2),2,(IF((E504=2),2,(IF((E503=1),1,(IF((E504=1),1,0)))))))","v":1},null,null,"Calculation cell to combine rodent holes with bunch grasses.  ",null,null,null,null,"Target is few or many."]
[null,null,21,"Amount of snags/stumps present",1,null,null,"Enter count bins ('0' for none, '1' for few [1-10], and '2' for many [>10]) in Column E. ",null,null,null,null,"Target is few or many.  For model, combine snags/nest boxes/pithy."]
[null,null,22,"Amount of nest boxes or nest bundles present",0,null,null,"In Column E, enter count bins ('0' for none, '0.5' for few [1-3] that are close and/or not maintained, '1' for few [1-3]) that are >50 holes or maintained, '1.5' for few [1-3] that are both >50 holes and maintained, '2' for many [>3] that are both >50 holes and maintained.  Give an extra point for multiple sized holes and/or small blocks w/less than 20 holes. Maximum is 3.",null,null,null,null,"Target many, maintained, etc..  For model, combine snags/nest boxes/pithy."]
[null,null,23,"Amount of plants with pithy tissue present",1," "," ","Total for percent cover for all relevant species documented, then in Column E, enter appropriate bin for total percent cover range:  enter '0' for <1%, enter '1' for 1 to 5%, and enter '2' for over 5%.",null,null,null,null,"Target is 5-25.  For model, combine snags/nest boxes/pithy."]
[null,null,{"$f":"CONCATENATE(C506,\", \",C507,\" and \",C508)","v":"21, 22 and 23"},"Amount of snags/stumps, nest boxes/bundles, pithy tissue",{"$f":"IF((E506=2),2,(IF((E507>=2),2,(IF((E508=2),2,(IF((E506=1),1,(IF((E507=1.5),1,(IF((E507=1),1,(IF((E508=1),1,0)))))))))))))","v":1},null,null,"Calculation cell to combine snags/stumps, nest boxes/bundles, and pithy tissue.  ",null,null,null,null,"Target is few or many."]
[null,null,{"$f":"CONCATENATE(C502,\" through \",C508)","v":"18 through 23"},"Diversity of available nesting materials",{"$f":"((IF(E502>0.09,1,0))+(IF(E505>0,1,0))+(IF(E509>0,1,0)))/3","v":0.66666666666666663},null,null,"Calculation cell.  Treat questions 8-10 separately and 11-13 combined (e.g., if a site has snags, nest boxes, or plants with pithy tissues, it counts towards the site diversity).",null,null,null,null,"Target is 1.0"]
[null,"Management: Soil disturbance",24,"Is the Map Unit tilled at some point during the year?",1,null,null,"In Column E, enter '1' for Yes or a '0' for No.",null,null,null,null,"0 is good"]
[null,null,25,"Is the Map Unit flood-irrigated at some point during the year?",0,null,null,"In Column E, enter '1' for Yes or a '0' for No.",null,null,null,null,"0 is good"]
[null,null,26,"Is plastic mulching used at the Map Unit?",1,null,null,"In Column E, enter '1' for Yes or a '0' for No.",null,null,null,null,"0 is good"]
[null,null,27,"Does road-grading or road-making occur on the Map Unit?",1,null,null,"In Column E, enter '1' for Yes or a '0' for No.",null,null,null,null,"0 is good"]
[null,null,28,"Total percent cover of the Map Unit that experiences any soil disturbance",{"$f":"MAX(F515:G515)","v":0.6},0.3,0.6,"Enter the percent cover inclusive of all types of soil disturbance min and max values (0, 1-10, 10-30, 30-60, 60-90, 90-100) in Columns F and G.",null,null,null,null,"0 is good"]
[null,"Management: Vegetation/ground disturbance",29,"Total cover of invasive noxious weeds",{"$f":"MAX(F516:G516)","v":0},0,0,"Enter total percent cover combined for all invasive noxious weeds documented min and max values (0, 0-1, 1-5, 5-25, 25-50, 50-75, 75-95, 95-100) in Columns F and G.",null,null,null,null,"0 is good"]
[null,null,30,"Number of invasive noxious weed species",5,null,null,"Enter count in Column E.  If there are 5 or more species, enter '5'.",null,null,null,null,"0 is good"]
[null,null,31,"Percent of the Map Unit burned during the blooming season (Feb through Sept)",{"$f":"MAX(F518:G518)","v":0},0,0,"Enter percent cover range min and max values (0, 1-10, 10-30, 30-60, 60-90, 90-100) in Columns F and G.",null,null,null,null,"0 is good"]
[null,null,32,"Percent of the Map Unit mowed and/or hayed during the blooming season (Feb through Sept)",{"$f":"MAX(F519:G519)","v":0.1},0.01,0.1,"Enter percent cover range min and max values (0, 1-10, 10-30, 30-60, 60-90, 90-100) in Columns F and G.",null,null,null,null,"0 is good"]
[null,null,33,"Total percent of the Map Unit burned, mowed, or hayed during the blooming season",{"$f":"MAX(F520:G520)","v":0.3},0.1,0.3,"Enter percent cover range min and max values (0, 1-10, 10-30, 30-60, 60-90, 90-100) in Columns F and G.",null,null,null,null,"0 is good"]

{"sheet":"BeeVegInputData","index":3,"n_rows":784,"n_cols":26,"rows_kept":784,"cut":false,"hidden":false,"merged":[[551,6,551,13],[629,6,629,13],[707,6,707,13],[82,6,82,13],[161,6,161,13],[239,6,239,13],[317,6,317,13],[355,3,355,6],[355,7,355,10],[355,11,355,13],[393,4,393,5],[433,3,433,6],[433,7,433,10],[433,11,433,13],[395,6,395,13],[199,3,199,6],[471,4,471,5],[511,3,511,6],[511,7,511,10],[511,11,511,13],[549,4,549,5],[473,6,473,13],[0,18,4,22],[81,4,81,5],[43,3,43,6],[43,7,43,10],[0,3,0,7],[1,3,1,7],[2,0,4,13],[43,11,43,13],[5,6,5,13],[199,7,199,10],[199,11,199,13],[121,3,121,6],[121,7,121,10],[121,11,121,13],[159,4,159,5],[315,4,315,5],[277,3,277,6],[277,7,277,10],[277,11,277,13],[237,4,237,5],[589,3,589,6],[589,7,589,10],[589,11,589,13],[627,4,627,5],[667,3,667,6],[667,7,667,10],[667,11,667,13],[705,4,705,5],[745,3,745,6],[745,7,745,10],[745,11,745,13],[783,4,783,5]]}
["Your Name:",null,null," ",null,null,null,null,"Date:"," ",null,null,null,null,"Fill in data",null,null,null,"Explanation: Entering the vegetation type code and age (columns D and E), enables the model to 'get' height and width growth rate values, shown in columns C-I of the 'VegTypeParameters' worksheet that are specific to that vegetation type or species. Horizontal surface area (i.e., the average width of the species at the given age multiplied by the average width of the species at the given age), vertical surface area (i.e., the average width of the species at the given age multiplied by the average height of the species at that same age), and blooming time for the specific species/vegetation type are then calculated in columns P-U. Those final values in dark green at the bottom of each Map Unit set are 'picked up' and used by the model to score the Map Unit for bee habitat quality. Height is calculated based on the maximum height, estimated maximum growth rate, and age using the logistic equation: Ht = Hmax *(1-exp(-rate*age/Hmax))."]
["Site Name:",null,null," ",null,null,null,null,null,null,null,null,null,null,"Grabs data from VTP  worksheet"]
["Directions: Only enter values into the yellow areas. Enter information for each Map Unit separately, per Map Unit Block. For example, data for the first Map Unit should be entered in rows 9 through 43, and for Map Unit 2 in rows 62 through 96. You can have multiple species/vegetation types within each Map Unit and multiple entries for the same species/vegetation type but of different ages (e.g., Lupinus 1 yr and Lupinus 4 yrs). For each vegetation entry, take the midpoint of the cover class category for that occurs with at least 1-5% cover in the Map Unit overall. Enter the cover class midpoint and code for each type in columns E and F (to find the appropriate code, see the 'VegTypeParameters' sheet).   Also, if the species is not listed, use a species with similar growth patterns and bloom time, or use one of the appropriate lumped species categories (e.g., “native forbs and graminoids not beneficial to pollinators”, “other early blooming native plants beneficial to pollinators”, “other exotic shrubs”). For each entry also enter the current average age of the plants. You may enter as many as 35 different species/veg type types for each Map Unit. If you have more than 35 entries, lump similar species into a single code.  Once completed, LEAVE the bottom-most army-green colored rows where values are automatically calculated and will be 'collected' by the Field Bee Form worksheet and go from there (automatically) into the Bee Scoring Model. You may enter vegetation information for up to 10 Map Units. Enter the size of each Map Unit just one time under the first line for that Map Unit, in square feet. ",null,null,null,null,null,null,null,null,null,null,null,null,null,"Calculation cell"]
[]
[]
["Enter only in yellow cells. Leave rest untouched.",null,null,null,null,null,"Enter the current year age in column G for each vegetation type. This age will be added to the assessment year (input on Field data form) to determine time series age in column K. If you are interested in just the current effects, enter a '0' in cell E11 of the Field data form."]
["Map Unit","Vegetation Entry","Map Unit Size","Spatial extent of Veg Type","Existing Cover Class for VegType","Species/ VegType","Existing Age of Average Plant \n(for S enter 1, for Sa enter 2, for P enter 3, for M enter 5, for D enter 10)","Species/Vegetation Type Descriptions","Ht Rate","Ht max","Future Age","Future Height","Canopy Width Max (m)","Canopy Width Rate","Existing Age canopy area per plant",null,"Estimated # Individuals","Future Horizontal Surface Area per plant (width x width)","Future Vertical Surface Area per plant (width x height)","Horizontal Surface Area Across Map Unit","Vertical Surface Area Across Map Unit","Season(s)","Season(s) (.)","Early","Mid","Late"]
["#","#"," sq ft","m2","%","code","yrs",null,"m/yr","m","yrs","m","m","m/yr","m2",null,"number","m2","m2","m2","m2",null,null,{"$f":"SUM(IF(FREQUENCY(MATCH(X9:X43, X9:X43,0),MATCH(X9:X43, X9:X43,0))>0,1))-1","v":7},{"$f":"SUM(IF(FREQUENCY(MATCH(Y9:Y43, Y9:Y43,0),MATCH(Y9:Y43, Y9:Y43,0))>0,1))-1","v":10},{"$f":"SUM(IF(FREQUENCY(MATCH(Z9:Z43, Z9:Z43,0),MATCH(Z9:Z43, Z9:Z43,0))>0,1))-1","v":7}]
[1,1,2200,{"$f":"(0.092903*C9)*E9","v":12.263195999999999},0.06,1600,5,{"$f":"VLOOKUP(F9,VegTypeParameters!A:G,2,FALSE)","v":"Atriplex"},{"$f":"VLOOKUP($F9,VegTypeParameters!$A:$G,5,FALSE)","v":3.2962962962962963},{"$f":"VLOOKUP($F9,VegTypeParameters!$A:$G,4,FALSE)","v":3},{"$f":"G9+FieldBeeForm!$E$11","v":17},{"$f":"IF(J9>0,J9*(1-EXP(-I9*K9/J9)), 0)","v":2.9999999768298276},{"$f":"(VLOOKUP($F9,VegTypeParameters!A:G,6,FALSE))","v":5},{"$f":"(VLOOKUP($F9,VegTypeParameters!A:G,7,FALSE))","v":7.1111111111111107},{"$f":"IF(M9>0, (M9*(1-EXP(-N9*G9/M9)))*(M9*(1-EXP(-N9*G9/M9))),0)","v":24.959217254150069},null,{"$f":"IF(O9>0, (D9*E9)/O9,0)","v":2.947976102406244E-2},{"$f":"IF(M9>0, (M9*(1-EXP(-N9*K9/M9)))*(M9*(1-EXP(-N9*K9/M9))), 0)","v":24.99999999841986},{"$f":"IF(M9>0,(M9*(1-EXP(-N9*K9/M9)))*L9,0)","v":14.999999883675097},{"$f":"R9*Q9","v":0.73699402555497884},{"$f":"S9*Q9","v":0.44219641193170622},{"$f":"VLOOKUP($F9,VegTypeParameters!$A:$H,8,FALSE)","v":"Mid/Late"},{"$f":"+IF(ISNA(V9), \".\",  V9)","v":"Mid/Late"},{"$f":"IF($W9=\"Early/Mid\",$H9,IF($W9=\"Early\", $H9, IF($W9=\"Early/Mid/Late\", $H9,\".\")))","v":"."},{"$f":"IF($W9=\"Early/Mid\",$H9,IF($W9=\"Mid\", $H9, IF($W9=\"Mid/Late\", $H9, IF($W9=\"Early/Mid/Late\", $H9,\".\"))))","v":"Atriplex"},{"$f":"IF($W9=\"Mid/Late\",$H9,IF($W9=\"Late\", $H9, IF($W9=\"Early/Mid/Late\", $H9,\".\")))","v":"Atriplex"}]
[1,2,{"$f":"+C$9","v":2200},{"$f":"(0.092903*C10)*E10","v":6.1315979999999994},0.03,4200,3,{"$f":"VLOOKUP(F10,VegTypeParameters!A:G,2,FALSE)","v":"Helianthus"},{"$f":"VLOOKUP($F10,VegTypeParameters!$A:$G,5,FALSE)","v":6.5},{"$f":"VLOOKUP($F10,VegTypeParameters!$A:$G,4,FALSE)","v":2.5},{"$f":"G10+FieldBeeForm!$E$11","v":15},2.5,{"$f":"(VLOOKUP($F10,VegTypeParameters!A:G,6,FALSE))","v":0.75},{"$f":"(VLOOKUP($F10,VegTypeParameters!A:G,7,FALSE))","v":1.25},0.55494534708652032,null,0.33147037084954789,0.56249999998437616,1.8749999999739604,0.18645208359769186,0.62150694533427098,{"$f":"VLOOKUP($F10,VegTypeParameters!$A:$H,8,FALSE)","v":"Mid/Late"},{"$f":"+IF(ISNA(V10), \".\",  V10)","v":"Mid/Late"},{"$f":"IF($W10=\"Early/Mid\",$H10,IF($W10=\"Early\", $H10, IF($W10=\"Early/Mid/Late\", $H10,\".\")))","v":"."},{"$f":"IF($W10=\"Early/Mid\",$H10,IF($W10=\"Mid\", $H10, IF($W10=\"Mid/Late\", $H10, IF($W10=\"Early/Mid/Late\", $H10,\".\"))))","v":"Helianthus"},{"$f":"IF($W10=\"Mid/Late\",$H10,IF($W10=\"Late\", $H10, IF($W10=\"Early/Mid/Late\", $H10,\".\")))","v":"Helianthus"}]
[1,3,{"$f":"+C$9","v":2200},16.350928,0.08,4000,3,{"$f":"VLOOKUP(F11,VegTypeParameters!A:G,2,FALSE)","v":"Grindelia"},{"$f":"VLOOKUP($F11,VegTypeParameters!$A:$G,5,FALSE)","v":1.6666666666666667},{"$f":"VLOOKUP($F11,VegTypeParameters!$A:$G,4,FALSE)","v":2.5},{"$f":"G11+FieldBeeForm!$E$11","v":15},2.4998865001755939,{"$f":"(VLOOKUP($F11,VegTypeParameters!A:G,6,FALSE))","v":2},{"$f":"(VLOOKUP($F11,VegTypeParameters!A:G,7,FALSE))","v":1.3333333333333333},2.9905802896620353,null,0.43739813457669285,3.9996368088065144,4.9995460110081433,1.7494336791562461,2.186792098945308,{"$f":"VLOOKUP($F11,VegTypeParameters!$A:$H,8,FALSE)","v":"Mid/Late"},"Mid/Late",".","Grindelia","Grindelia"]
[1,4,2200,16.350928,0.08,7000,3,{"$f":"VLOOKUP(F12,VegTypeParameters!A:G,2,FALSE)","v":"Salix (shrub)"},{"$f":"VLOOKUP($F12,VegTypeParameters!$A:$G,5,FALSE)","v":0.73},{"$f":"VLOOKUP($F12,VegTypeParameters!$A:$G,4,FALSE)","v":3.5},{"$f":"G12+FieldBeeForm!$E$11","v":15},3.3467689644197414,{"$f":"(VLOOKUP($F12,VegTypeParameters!A:G,6,FALSE))","v":2.5},{"$f":"(VLOOKUP($F12,VegTypeParameters!A:G,7,FALSE))","v":0.55000000000000004},1.4589539561403246,null,0.89658363411311615,5.7974627077191743,8.0583238111294335,5.1979101831221239,7.2249612474426836,{"$f":"VLOOKUP($F12,VegTypeParameters!$A:$H,8,FALSE)","v":"Early"},"Early","Salix (shrub)",".","."]
[1,5,2200,16.350928,0.08,8400,5,{"$f":"VLOOKUP(F13,VegTypeParameters!A:G,2,FALSE)","v":"Weeds, non-invasive and not beneficial to pollinators"},{"$f":"VLOOKUP($F13,VegTypeParameters!$A:$G,5,FALSE)","v":0},{"$f":"VLOOKUP($F13,VegTypeParameters!$A:$G,4,FALSE)","v":0},{"$f":"G13+FieldBeeForm!$E$11","v":17},0,{"$f":"(VLOOKUP($F13,VegTypeParameters!A:G,6,FALSE))","v":0},{"$f":"(VLOOKUP($F13,VegTypeParameters!A:G,7,FALSE))","v":0},0,null,0,0,0,0,0,{"$f":"VLOOKUP($F13,VegTypeParameters!$A:$H,8,FALSE)","v":"Never"},"Never",".",".","."]
[1,6,2200,16.350928,0.08,5300,3,{"$f":"VLOOKUP(F14,VegTypeParameters!A:G,2,FALSE)","v":"Medicago "},{"$f":"VLOOKUP($F14,VegTypeParameters!$A:$G,5,FALSE)","v":0.5},{"$f":"VLOOKUP($F14,VegTypeParameters!$A:$G,4,FALSE)","v":0.5},{"$f":"G14+FieldBeeForm!$E$11","v":15},0.49999984704883976,{"$f":"(VLOOKUP($F14,VegTypeParameters!A:G,6,FALSE))","v":0.7},{"$f":"(VLOOKUP($F14,VegTypeParameters!A:G,7,FALSE))","v":0.7},0.44242326156605982,null,2.9566127137388021,0.48999970021577172,0.34999978586840841,1.4487393433861524,1.0348138167043945,{"$f":"VLOOKUP($F14,VegTypeParameters!$A:$H,8,FALSE)","v":"Mid/Late"},"Mid/Late",".","Medicago ","Medicago "]
[1,7,2200,16.350928,0.08,1600,3,{"$f":"VLOOKUP(F15,VegTypeParameters!A:G,2,FALSE)","v":"Atriplex"},{"$f":"VLOOKUP($F15,VegTypeParameters!$A:$G,5,FALSE)","v":3.2962962962962963},{"$f":"VLOOKUP($F15,VegTypeParameters!$A:$G,4,FALSE)","v":3},{"$f":"G15+FieldBeeForm!$E$11","v":15},2.999999791404568,{"$f":"(VLOOKUP($F15,VegTypeParameters!A:G,6,FALSE))","v":5},{"$f":"(VLOOKUP($F15,VegTypeParameters!A:G,7,FALSE))","v":7.1111111111111107},24.303496604054391,null,5.382247095184578E-2,24.999999972834292,14.999998948873127,1.345561772334019,0.80733700770344108,{"$f":"VLOOKUP($F15,VegTypeParameters!$A:$H,8,FALSE)","v":"Mid/Late"},"Mid/Late",".","Atriplex","Atriplex"]
[1,8,2200,6.1315979999999994,0.03,7500,3,{"$f":"VLOOKUP(F16,VegTypeParameters!A:G,2,FALSE)","v":"Scrophularia"},{"$f":"VLOOKUP($F16,VegTypeParameters!$A:$G,5,FALSE)","v":1.2},{"$f":"VLOOKUP($F16,VegTypeParameters!$A:$G,4,FALSE)","v":1.2},{"$f":"G16+FieldBeeForm!$E$11","v":15},1.1999996329172153,{"$f":"(VLOOKUP($F16,VegTypeParameters!A:G,6,FALSE))","v":0.3},{"$f":"(VLOOKUP($F16,VegTypeParameters!A:G,7,FALSE))","v":0.3},8.1261415389684455E-2,null,2.26365660895627,8.9999944937590726E-2,0.3599997797503629,0.20372897016367764,0.81491588065471054,{"$f":"VLOOKUP($F16,VegTypeParameters!$A:$H,8,FALSE)","v":"Early/Mid"},"Early/Mid","Scrophularia","Scrophularia","."]
[1,9,2200,6.1315979999999994,0.03,3500,3,{"$f":"VLOOKUP(F17,VegTypeParameters!A:G,2,FALSE)","v":"Ficus carica"},{"$f":"VLOOKUP($F17,VegTypeParameters!$A:$G,5,FALSE)","v":0},{"$f":"VLOOKUP($F17,VegTypeParameters!$A:$G,4,FALSE)","v":0},{"$f":"G17+FieldBeeForm!$E$11","v":15},0,{"$f":"(VLOOKUP($F17,VegTypeParameters!A:G,6,FALSE))","v":0},{"$f":"(VLOOKUP($F17,VegTypeParameters!A:G,7,FALSE))","v":0},0,null,0,0,0,0,0,{"$f":"VLOOKUP($F17,VegTypeParameters!$A:$H,8,FALSE)","v":"Never"},"Never",".",".","."]
[1,10,2200,6.1315979999999994,0.03,6200,3,{"$f":"VLOOKUP(F18,VegTypeParameters!A:G,2,FALSE)","v":"Other late blooming native plants beneficial to pollinators"},{"$f":"VLOOKUP($F18,VegTypeParameters!$A:$G,5,FALSE)","v":0.25},{"$f":"VLOOKUP($F18,VegTypeParameters!$A:$G,4,FALSE)","v":1},{"$f":"G18+FieldBeeForm!$E$11","v":15},0.97648225414399092,{"$f":"(VLOOKUP($F18,VegTypeParameters!A:G,6,FALSE))","v":0.5},{"$f":"(VLOOKUP($F18,VegTypeParameters!A:G,7,FALSE))","v":0.25},0.15088168701775109,null,1.2191535211185613,0.24972353429050623,0.48797108853574861,0.30445132613644244,0.59491167079241514,{"$f":"VLOOKUP($F18,VegTypeParameters!$A:$H,8,FALSE)","v":"Late"},"Late",".",".","Other late blooming native plants beneficial to pollinators"]
[1,11,2200,6.1315979999999994,0.03,2500,3,{"$f":"VLOOKUP(F19,VegTypeParameters!A:G,2,FALSE)","v":"Clarkia"},{"$f":"VLOOKUP($F19,VegTypeParameters!$A:$G,5,FALSE)","v":0.4},{"$f":"VLOOKUP($F19,VegTypeParameters!$A:$G,4,FALSE)","v":0.4},{"$f":"G19+FieldBeeForm!$E$11","v":15},0.39999987763907185,{"$f":"(VLOOKUP($F19,VegTypeParameters!A:G,6,FALSE))","v":0.1},{"$f":"(VLOOKUP($F19,VegTypeParameters!A:G,7,FALSE))","v":0.1},9.029046154409387E-3,null,20.372909480606424,9.9999938819545289E-3,3.9999975527818116E-2,0.20372897016367766,0.81491588065471066,{"$f":"VLOOKUP($F19,VegTypeParameters!$A:$H,8,FALSE)","v":"Early/Mid"},"Early/Mid","Clarkia","Clarkia","."]
[1,12,2200,16.350928,0.08,5000,3,{"$f":"VLOOKUP(F20,VegTypeParameters!A:G,2,FALSE)","v":"Lupinus spp."},{"$f":"VLOOKUP($F20,VegTypeParameters!$A:$G,5,FALSE)","v":0.98000000000000009},{"$f":"VLOOKUP($F20,VegTypeParameters!$A:$G,4,FALSE)","v":3},{"$f":"G20+FieldBeeForm!$E$11","v":15},2.9776602507872267,{"$f":"(VLOOKUP($F20,VegTypeParameters!A:G,6,FALSE))","v":3},{"$f":"(VLOOKUP($F20,VegTypeParameters!A:G,7,FALSE))","v":1.08},3.925206627733659,null,0.33324977868878658,8.9188851385636738,8.8926342217348378,2.9722164985770521,2.9634683863534645,{"$f":"VLOOKUP($F20,VegTypeParameters!$A:$H,8,FALSE)","v":"Early/Mid/Late"},"Early/Mid/Late","Lupinus spp.","Lupinus spp.","Lupinus spp."]
[1,13,2200,16.350928,0.08,6000,3,{"$f":"VLOOKUP(F21,VegTypeParameters!A:G,2,FALSE)","v":"Orchard"},{"$f":"VLOOKUP($F21,VegTypeParameters!$A:$G,5,FALSE)","v":0.5},{"$f":"VLOOKUP($F21,VegTypeParameters!$A:$G,4,FALSE)","v":10},{"$f":"G21+FieldBeeForm!$E$11","v":15},5.2763344725898529,{"$f":"(VLOOKUP($F21,VegTypeParameters!A:G,6,FALSE))","v":6},{"$f":"(VLOOKUP($F21,VegTypeParameters!A:G,7,FALSE))","v":0.5},1.7614473685136525,null,0.74261329823540601,18.326714576526665,22.58783601812447,13.609661957493358,16.774027405419911,{"$f":"VLOOKUP($F21,VegTypeParameters!$A:$H,8,FALSE)","v":"Early"},"Early","Orchard",".","."]
[1,14,2200,6.1315979999999994,0.03,3300,5,{"$f":"VLOOKUP(F22,VegTypeParameters!A:G,2,FALSE)","v":"Eschscholzia"},{"$f":"VLOOKUP($F22,VegTypeParameters!$A:$G,5,FALSE)","v":0.6},{"$f":"VLOOKUP($F22,VegTypeParameters!$A:$G,4,FALSE)","v":0.3},{"$f":"G22+FieldBeeForm!$E$11","v":17},0.29999999999999949,{"$f":"(VLOOKUP($F22,VegTypeParameters!A:G,6,FALSE))","v":0.15},{"$f":"(VLOOKUP($F22,VegTypeParameters!A:G,7,FALSE))","v":0.3},2.2497957049536645E-2,null,8.1762063815384725,2.2499999999999923E-2,4.4999999999999846E-2,0.18396464358461501,0.36792928716923001,{"$f":"VLOOKUP($F22,VegTypeParameters!$A:$H,8,FALSE)","v":"Early/Mid"},"Early/Mid","Eschscholzia","Eschscholzia","."]
[1,15,2200,6.1315979999999994,0.03,5600,3,{"$f":"VLOOKUP(F23,VegTypeParameters!A:G,2,FALSE)","v":"Native forbs and graminoids not beneficial to pollinators"},{"$f":"VLOOKUP($F23,VegTypeParameters!$A:$G,5,FALSE)","v":0},{"$f":"VLOOKUP($F23,VegTypeParameters!$A:$G,4,FALSE)","v":0},{"$f":"G23+FieldBeeForm!$E$11","v":15},{"$f":"IF(J23>0,J23*(1-EXP(-I23*K23/J23)), 0)","v":0},{"$f":"(VLOOKUP($F23,VegTypeParameters!A:G,6,FALSE))","v":0},{"$f":"(VLOOKUP($F23,VegTypeParameters!A:G,7,FALSE))","v":0},{"$f":"IF(M23>0, (M23*(1-EXP(-N23*G23/M23)))*(M23*(1-EXP(-N23*G23/M23))),0)","v":0},null,{"$f":"IF(O23>0, (D23*E23)/O23,0)","v":0},{"$f":"IF(M23>0, (M23*(1-EXP(-N23*K23/M23)))*(M23*(1-EXP(-N23*K23/M23))), 0)","v":0},{"$f":"IF(M23>0,(M23*(1-EXP(-N23*K23/M23)))*L23,0)","v":0},{"$f":"R23*Q23","v":0},{"$f":"S23*Q23","v":0},{"$f":"VLOOKUP($F23,VegTypeParameters!$A:$H,8,FALSE)","v":"Never"},"Never",".",".","."]
[1,16,2200,16.350928,0.08,3800,3,{"$f":"VLOOKUP(F24,VegTypeParameters!A:G,2,FALSE)","v":"Gilia"},{"$f":"VLOOKUP($F24,VegTypeParameters!$A:$G,5,FALSE)","v":0.6},{"$f":"VLOOKUP($F24,VegTypeParameters!$A:$G,4,FALSE)","v":0.3},{"$f":"G24+FieldBeeForm!$E$11","v":15},{"$f":"IF(J24>0,J24*(1-EXP(-I24*K24/J24)), 0)","v":0.2999999999999719},{"$f":"(VLOOKUP($F24,VegTypeParameters!A:G,6,FALSE))","v":0.15},{"$f":"(VLOOKUP($F24,VegTypeParameters!A:G,7,FALSE))","v":0.3},{"$f":"IF(M24>0, (M24*(1-EXP(-N24*G24/M24)))*(M24*(1-EXP(-N24*G24/M24))),0)","v":2.2388594396827964E-2},null,{"$f":"IF(O24>0, (D24*E24)/O24,0)","v":58.425920663662978},{"$f":"IF(M24>0, (M24*(1-EXP(-N24*K24/M24)))*(M24*(1-EXP(-N24*K24/M24))), 0)","v":2.2499999999995784E-2},{"$f":"IF(M24>0,(M24*(1-EXP(-N24*K24/M24)))*L24,0)","v":4.4999999999991568E-2},{"$f":"R24*Q24","v":1.3145832149321708},{"$f":"S24*Q24","v":2.6291664298643416},{"$f":"VLOOKUP($F24,VegTypeParameters!$A:$H,8,FALSE)","v":"Mid"},"Mid",".","Gilia","."]
[1,17,2200,16.350928,0.08,1500,3,{"$f":"VLOOKUP(F25,VegTypeParameters!A:G,2,FALSE)","v":"Asclepias"},{"$f":"VLOOKUP($F25,VegTypeParameters!$A:$G,5,FALSE)","v":0.8},{"$f":"VLOOKUP($F25,VegTypeParameters!$A:$G,4,FALSE)","v":0.8},{"$f":"G25+FieldBeeForm!$E$11","v":15},0.79999975527814371,{"$f":"(VLOOKUP($F25,VegTypeParameters!A:G,6,FALSE))","v":0.2},{"$f":"(VLOOKUP($F25,VegTypeParameters!A:G,7,FALSE))","v":0.2},3.6116184617637548E-2,null,36.218505743300319,3.9999975527818116E-2,0.15999990211127246,1.4487393433861526,5.7949573735446105,{"$f":"VLOOKUP($F25,VegTypeParameters!$A:$H,8,FALSE)","v":"Early/Mid/Late"},"Early/Mid/Late","Asclepias","Asclepias","Asclepias"]
[1,18,2200,1.021933,5.0000000000000001E-3,1600,1,{"$f":"VLOOKUP(F26,VegTypeParameters!A:G,2,FALSE)","v":"Atriplex"},{"$f":"VLOOKUP($F26,VegTypeParameters!$A:$G,5,FALSE)","v":3.2962962962962963},{"$f":"VLOOKUP($F26,VegTypeParameters!$A:$G,4,FALSE)","v":3},{"$f":"G26+FieldBeeForm!$E$11","v":13},2.9999981220660135,{"$f":"(VLOOKUP($F26,VegTypeParameters!A:G,6,FALSE))","v":5},{"$f":"(VLOOKUP($F26,VegTypeParameters!A:G,7,FALSE))","v":7.1111111111111107},14.395290762184326,null,3.5495392794863322E-4,24.999999532966985,14.999990470220251,8.8738480329406278E-3,5.3243055365967441E-3,{"$f":"VLOOKUP($F26,VegTypeParameters!$A:$H,8,FALSE)","v":"Mid/Late"},"Mid/Late",".","Atriplex","Atriplex"]
[1,19,2200,0,null,null,null,{"$f":"VLOOKUP(F27,VegTypeParameters!A:G,2,FALSE)","v":{"$error":"#N/A"}},{"$f":"VLOOKUP($F27,VegTypeParameters!$A:$G,5,FALSE)","v":{"$error":"#N/A"}},{"$f":"VLOOKUP($F27,VegTypeParameters!$A:$G,4,FALSE)","v":{"$error":"#N/A"}},{"$f":"G27+FieldBeeForm!$E$11","v":12},{"$f":"IF(J27>0,J27*(1-EXP(-I27*K27/J27)), 0)","v":{"$error":"#N/A"}},{"$f":"(VLOOKUP($F27,VegTypeParameters!A:G,6,FALSE))","v":{"$error":"#N/A"}},{"$f":"(VLOOKUP($F27,VegTypeParameters!A:G,7,FALSE))","v":{"$error":"#N/A"}},{"$f":"IF(M27>0, (M27*(1-EXP(-N27*G27/M27)))*(M27*(1-EXP(-N27*G27/M27))),0)","v":{"$error":"#N/A"}},null,{"$f":"IF(O27>0, (D27*E27)/O27,0)","v":{"$error":"#N/A"}},{"$f":"IF(M27>0, (M27*(1-EXP(-N27*K27/M27)))*(M27*(1-EXP(-N27*K27/M27))), 0)","v":{"$error":"#N/A"}},{"$f":"IF(M27>0,(M27*(1-EXP(-N27*K27/M27)))*L27,0)","v":{"$error":"#N/A"}},{"$f":"R27*Q27","v":{"$error":"#N/A"}},{"$f":"S27*Q27","v":{"$error":"#N/A"}},{"$f":"VLOOKUP($F27,VegTypeParameters!$A:$H,8,FALSE)","v":{"$error":"#N/A"}},".",".",".","."]
[1,20,2200,0,null,null,null,{"$f":"VLOOKUP(F28,VegTypeParameters!A:G,2,FALSE)","v":{"$error":"#N/A"}},{"$f":"VLOOKUP($F28,VegTypeParameters!$A:$G,5,FALSE)","v":{"$error":"#N/A"}},{"$f":"VLOOKUP($F28,VegTypeParameters!$A:$G,4,FALSE)","v":{"$error":"#N/A"}},{"$f":"G28+FieldBeeForm!$E$11","v":12},{"$error":"#N/A"},{"$f":"(VLOOKUP($F28,VegTypeParameters!A:G,6,FALSE))","v":{"$error":"#N/A"}},{"$f":"(VLOOKUP($F28,VegTypeParameters!A:G,7,FALSE))","v":{"$error":"#N/A"}},{"$error":"#N/A"},null,{"$error":"#N/A"},{"$error":"#N/A"},{"$error":"#N/A"},{"$error":"#N/A"},{"$error":"#N/A"},{"$f":"VLOOKUP($F28,VegTypeParameters!$A:$H,8,FALSE)","v":{"$error":"#N/A"}},".",".",".","."]
[1,21,2200,0,null,null,null,{"$f":"VLOOKUP(F29,VegTypeParameters!A:G,2,FALSE)","v":{"$error":"#N/A"}},{"$f":"VLOOKUP($F29,VegTypeParameters!$A:$G,5,FALSE)","v":{"$error":"#N/A"}},{"$f":"VLOOKUP($F29,VegTypeParameters!$A:$G,4,FALSE)","v":{"$error":"#N/A"}},{"$f":"G29+FieldBeeForm!$E$11","v":12},{"$error":"#N/A"},{"$f":"(VLOOKUP($F29,VegTypeParameters!A:G,6,FALSE))","v":{"$error":"#N/A"}},{"$f":"(VLOOKUP($F29,VegTypeParameters!A:G,7,FALSE))","v":{"$error":"#N/A"}},{"$error":"#N/A"},null,{"$error":"#N/A"},{"$error":"#N/A"},{"$error":"#N/A"},{"$error":"#N/A"},{"$error":"#N/A"},{"$f":"VLOOKUP($F29,VegTypeParameters!$A:$H,8,FALSE)","v":{"$error":"#N/A"}},".",".",".","."]
[1,22,2200,0,null,null,null,{"$f":"VLOOKUP(F30,VegTypeParameters!A:G,2,FALSE)","v":{"$error":"#N/A"}},{"$f":"VLOOKUP($F30,VegTypeParameters!$A:$G,5,FALSE)","v":{"$error":"#N/A"}},{"$f":"VLOOKUP($F30,VegTypeParameters!$A:$G,4,FALSE)","v":{"$error":"#N/A"}},{"$f":"G30+FieldBeeForm!$E$11","v":12},{"$error":"#N/A"},{"$f":"(VLOOKUP($F30,VegTypeParameters!A:G,6,FALSE))","v":{"$error":"#N/A"}},{"$f":"(VLOOKUP($F30,VegTypeParameters!A:G,7,FALSE))","v":{"$error":"#N/A"}},{"$error":"#N/A"},null,{"$error":"#N/A"},{"$error":"#N/A"},{"$error":"#N/A"},{"$error":"#N/A"},{"$error":"#N/A"},{"$f":"VLOOKUP($F30,VegTypeParameters!$A:$H,8,FALSE)","v":{"$error":"#N/A"}},".",".",".","."]
[1,23,2200,0,null,null,null,{"$f":"VLOOKUP(F31,VegTypeParameters!A:G,2,FALSE)","v":{"$error":"#N/A"}},{"$f":"VLOOKUP($F31,VegTypeParameters!$A:$G,5,FALSE)","v":{"$error":"#N/A"}},{"$f":"VLOOKUP($F31,VegTypeParameters!$A:$G,4,FALSE)","v":{"$error":"#N/A"}},{"$f":"G31+FieldBeeForm!$E$11","v":12},{"$error":"#N/A"},{"$f":"(VLOOKUP($F31,VegTypeParameters!A:G,6,FALSE))","v":{"$error":"#N/A"}},{"$f":"(VLOOKUP($F31,VegTypeParameters!A:G,7,FALSE))","v":{"$error":"#N/A"}},{"$error":"#N/A"},null,{"$error":"#N/A"},{"$error":"#N/A"},{"$error":"#N/A"},{"$error":"#N/A"},{"$error":"#N/A"},{"$f":"VLOOKUP($F31,VegTypeParameters!$A:$H,8,FALSE)","v":{"$error":"#N/A"}},".",".",".","."]
[1,24,2200,0,null,null,null,{"$f":"VLOOKUP(F32,VegTypeParameters!A:G,2,FALSE)","v":{"$error":"#N/A"}},{"$f":"VLOOKUP($F32,VegTypeParameters!$A:$G,5,FALSE)","v":{"$error":"#N/A"}},{"$f":"VLOOKUP($F32,VegTypeParameters!$A:$G,4,FALSE)","v":{"$error":"#N/A"}},{"$f":"G32+FieldBeeForm!$E$11","v":12},{"$error":"#N/A"},{"$f":"(VLOOKUP($F32,VegTypeParameters!A:G,6,FALSE))","v":{"$error":"#N/A"}},{"$f":"(VLOOKUP($F32,VegTypeParameters!A:G,7,FALSE))","v":{"$error":"#N/A"}},{"$error":"#N/A"},null,{"$error":"#N/A"},{"$error":"#N/A"},{"$error":"#N/A"},{"$error":"#N/A"},{"$error":"#N/A"},{"$f":"VLOOKUP($F32,VegTypeParameters!$A:$H,8,FALSE)","v":{"$error":"#N/A"}},".",".",".","."]
[1,25,2200,0,null,null,null,{"$f":"VLOOKUP(F33,VegTypeParameters!A:G,2,FALSE)","v":{"$error":"#N/A"}},{"$f":"VLOOKUP($F33,VegTypeParameters!$A:$G,5,FALSE)","v":{"$error":"#N/A"}},{"$f":"VLOOKUP($F33,VegTypeParameters!$A:$G,4,FALSE)","v":{"$error":"#N/A"}},{"$f":"G33+FieldBeeForm!$E$11","v":12},{"$f":"IF(J33>0,J33*(1-EXP(-I33*K33/J33)), 0)","v":{"$error":"#N/A"}},{"$f":"(VLOOKUP($F33,VegTypeParameters!A:G,6,FALSE))","v":{"$error":"#N/A"}},{"$f":"(VLOOKUP($F33,VegTypeParameters!A:G,7,FALSE))","v":{"$error":"#N/A"}},{"$f":"IF(M33>0, (M33*(1-EXP(-N33*G33/M33)))*(M33*(1-EXP(-N33*G33/M33))),0)","v":{"$error":"#N/A"}},null,{"$f":"IF(O33>0, (D33*E33)/O33,0)","v":{"$error":"#N/A"}},{"$f":"IF(M33>0, (M33*(1-EXP(-N33*K33/M33)))*(M33*(1-EXP(-N33*K33/M33))), 0)","v":{"$error":"#N/A"}},{"$f":"IF(M33>0,(M33*(1-EXP(-N33*K33/M33)))*L33,0)","v":{"$error":"#N/A"}},{"$f":"R33*Q33","v":{"$error":"#N/A"}},{"$f":"S33*Q33","v":{"$error":"#N/A"}},{"$f":"VLOOKUP($F33,VegTypeParameters!$A:$H,8,FALSE)","v":{"$error":"#N/A"}},{"$f":"+IF(ISNA(V33), \".\",  V33)","v":"."},".",".","."]
[1,26,2200,0,null,null,null,{"$f":"VLOOKUP(F34,VegTypeParameters!A:G,2,FALSE)","v":{"$error":"#N/A"}},{"$f":"VLOOKUP($F34,VegTypeParameters!$A:$G,5,FALSE)","v":{"$error":"#N/A"}},{"$f":"VLOOKUP($F34,VegTypeParameters!$A:$G,4,FALSE)","v":{"$error":"#N/A"}},{"$f":"G34+FieldBeeForm!$E$11","v":12},{"$f":"IF(J34>0,J34*(1-EXP(-I34*K34/J34)), 0)","v":{"$error":"#N/A"}},{"$f":"(VLOOKUP($F34,VegTypeParameters!A:G,6,FALSE))","v":{"$error":"#N/A"}},{"$f":"(VLOOKUP($F34,VegTypeParameters!A:G,7,FALSE))","v":{"$error":"#N/A"}},{"$f":"IF(M34>0, (M34*(1-EXP(-N34*G34/M34)))*(M34*(1-EXP(-N34*G34/M34))),0)","v":{"$error":"#N/A"}},null,{"$f":"IF(O34>0, (D34*E34)/O34,0)","v":{"$error":"#N/A"}},{"$f":"IF(M34>0, (M34*(1-EXP(-N34*K34/M34)))*(M34*(1-EXP(-N34*K34/M34))), 0)","v":{"$error":"#N/A"}},{"$f":"IF(M34>0,(M34*(1-EXP(-N34*K34/M34)))*L34,0)","v":{"$error":"#N/A"}},{"$error":"#N/A"},{"$error":"#N/A"},{"$f":"VLOOKUP($F34,VegTypeParameters!$A:$H,8,FALSE)","v":{"$error":"#N/A"}},".",".",".","."]
[1,27,2200,0,null,null,null,{"$f":"VLOOKUP(F35,VegTypeParameters!A:G,2,FALSE)","v":{"$error":"#N/A"}},{"$f":"VLOOKUP($F35,VegTypeParameters!$A:$G,5,FALSE)","v":{"$error":"#N/A"}},{"$f":"VLOOKUP($F35,VegTypeParameters!$A:$G,4,FALSE)","v":{"$error":"#N/A"}},{"$f":"G35+FieldBeeForm!$E$11","v":12},{"$error":"#N/A"},{"$f":"(VLOOKUP($F35,VegTypeParameters!A:G,6,FALSE))","v":{"$error":"#N/A"}},{"$f":"(VLOOKUP($F35,VegTypeParameters!A:G,7,FALSE))","v":{"$error":"#N/A"}},{"$error":"#N/A"},null,{"$error":"#N/A"},{"$error":"#N/A"},{"$error":"#N/A"},{"$error":"#N/A"},{"$error":"#N/A"},{"$f":"VLOOKUP($F35,VegTypeParameters!$A:$H,8,FALSE)","v":{"$error":"#N/A"}},".",".",".","."]
[1,28,2200,0,null,null,null,{"$f":"VLOOKUP(F36,VegTypeParameters!A:G,2,FALSE)","v":{"$error":"#N/A"}},{"$f":"VLOOKUP($F36,VegTypeParameters!$A:$G,5,FALSE)","v":{"$error":"#N/A"}},{"$f":"VLOOKUP($F36,VegTypeParameters!$A:$G,4,FALSE)","v":{"$error":"#N/A"}},{"$f":"G36+FieldBeeForm!$E$11","v":12},{"$error":"#N/A"},{"$f":"(VLOOKUP($F36,VegTypeParameters!A:G,6,FALSE))","v":{"$error":"#N/A"}},{"$f":"(VLOOKUP($F36,VegTypeParameters!A:G,7,FALSE))","v":{"$error":"#N/A"}},{"$error":"#N/A"},null,{"$error":"#N/A"},{"$error":"#N/A"},{"$error":"#N/A"},{"$error":"#N/A"},{"$error":"#N/A"},{"$f":"VLOOKUP($F36,VegTypeParameters!$A:$H,8,FALSE)","v":{"$error":"#N/A"}},".",".",".","."]
[1,29,2200,0,null,null,null,{"$f":"VLOOKUP(F37,VegTypeParameters!A:G,2,FALSE)","v":{"$error":"#N/A"}},{"$f":"VLOOKUP($F37,VegTypeParameters!$A:$G,5,FALSE)","v":{"$error":"#N/A"}},{"$f":"VLOOKUP($F37,VegTypeParameters!$A:$G,4,FALSE)","v":{"$error":"#N/A"}},{"$f":"G37+FieldBeeForm!$E$11","v":12},{"$error":"#N/A"},{"$f":"(VLOOKUP($F37,VegTypeParameters!A:G,6,FALSE))","v":{"$error":"#N/A"}},{"$f":"(VLOOKUP($F37,VegTypeParameters!A:G,7,FALSE))","v":{"$error":"#N/A"}},{"$error":"#N/A"},null,{"$error":"#N/A"},{"$error":"#N/A"},{"$error":"#N/A"},{"$f":"R37*Q37","v":{"$error":"#N/A"}},{"$f":"S37*Q37","v":{"$error":"#N/A"}},{"$f":"VLOOKUP($F37,VegTypeParameters!$A:$H,8,FALSE)","v":{"$error":"#N/A"}},{"$f":"+IF(ISNA(V37), \".\",  V37)","v":"."},".",".","."]
[1,30,2200,0,null,null,null,{"$f":"VLOOKUP(F38,VegTypeParameters!A:G,2,FALSE)","v":{"$error":"#N/A"}},{"$f":"VLOOKUP($F38,VegTypeParameters!$A:$G,5,FALSE)","v":{"$error":"#N/A"}},{"$f":"VLOOKUP($F38,VegTypeParameters!$A:$G,4,FALSE)","v":{"$error":"#N/A"}},{"$f":"G38+FieldBeeForm!$E$11","v":12},{"$error":"#N/A"},{"$f":"(VLOOKUP($F38,VegTypeParameters!A:G,6,FALSE))","v":{"$error":"#N/A"}},{"$f":"(VLOOKUP($F38,VegTypeParameters!A:G,7,FALSE))","v":{"$error":"#N/A"}},{"$error":"#N/A"},null,{"$error":"#N/A"},{"$error":"#N/A"},{"$error":"#N/A"},{"$error":"#N/A"},{"$error":"#N/A"},{"$f":"VLOOKUP($F38,VegTypeParameters!$A:$H,8,FALSE)","v":{"$error":"#N/A"}},".",".",".","."]
[1,31,2200,0,null,null,null,{"$f":"VLOOKUP(F39,VegTypeParameters!A:G,2,FALSE)","v":{"$error":"#N/A"}},{"$f":"VLOOKUP($F39,VegTypeParameters!$A:$G,5,FALSE)","v":{"$error":"#N/A"}},{"$f":"VLOOKUP($F39,VegTypeParameters!$A:$G,4,FALSE)","v":{"$error":"#N/A"}},{"$f":"G39+FieldBeeForm!$E$11","v":12},{"$error":"#N/A"},{"$f":"(VLOOKUP($F39,VegTypeParameters!A:G,6,FALSE))","v":{"$error":"#N/A"}},{"$f":"(VLOOKUP($F39,VegTypeParameters!A:G,7,FALSE))","v":{"$error":"#N/A"}},{"$error":"#N/A"},null,{"$error":"#N/A"},{"$error":"#N/A"},{"$error":"#N/A"},{"$error":"#N/A"},{"$error":"#N/A"},{"$f":"VLOOKUP($F39,VegTypeParameters!$A:$H,8,FALSE)","v":{"$error":"#N/A"}},".",".",".","."]
[1,32,2200,0,null,null,null,{"$f":"VLOOKUP(F40,VegTypeParameters!A:G,2,FALSE)","v":{"$error":"#N/A"}},{"$f":"VLOOKUP($F40,VegTypeParameters!$A:$G,5,FALSE)","v":{"$error":"#N/A"}},{"$f":"VLOOKUP($F40,VegTypeParameters!$A:$G,4,FALSE)","v":{"$error":"#N/A"}},{"$f":"G40+FieldBeeForm!$E$11","v":12},{"$error":"#N/A"},{"$f":"(VLOOKUP($F40,VegTypeParameters!A:G,6,FALSE))","v":{"$error":"#N/A"}},{"$f":"(VLOOKUP($F40,VegTypeParameters!A:G,7,FALSE))","v":{"$error":"#N/A"}},{"$error":"#N/A"},null,{"$error":"#N/A"},{"$error":"#N/A"},{"$error":"#N/A"},{"$error":"#N/A"},{"$error":"#N/A"},{"$f":"VLOOKUP($F40,VegTypeParameters!$A:$H,8,FALSE)","v":{"$error":"#N/A"}},".",".",".","."]
[1,33,2200,0,null,null,null,{"$f":"VLOOKUP(F41,VegTypeParameters!A:G,2,FALSE)","v":{"$error":"#N/A"}},{"$f":"VLOOKUP($F41,VegTypeParameters!$A:$G,5,FALSE)","v":{"$error":"#N/A"}},{"$f":"VLOOKUP($F41,VegTypeParameters!$A:$G,4,FALSE)","v":{"$error":"#N/A"}},{"$f":"G41+FieldBeeForm!$E$11","v":12},{"$error":"#N/A"},{"$f":"(VLOOKUP($F41,VegTypeParameters!A:G,6,FALSE))","v":{"$error":"#N/A"}},{"$f":"(VLOOKUP($F41,VegTypeParameters!A:G,7,FALSE))","v":{"$error":"#N/A"}},{"$error":"#N/A"},null,{"$error":"#N/A"},{"$error":"#N/A"},{"$error":"#N/A"},{"$error":"#N/A"},{"$error":"#N/A"},{"$f":"VLOOKUP($F41,VegTypeParameters!$A:$H,8,FALSE)","v":{"$error":"#N/A"}},".",".",".","."]
[1,34,2200,0,null,null,null,{"$f":"VLOOKUP(F42,VegTypeParameters!A:G,2,FALSE)","v":{"$error":"#N/A"}},{"$f":"VLOOKUP($F42,VegTypeParameters!$A:$G,5,FALSE)","v":{"$error":"#N/A"}},{"$f":"VLOOKUP($F42,VegTypeParameters!$A:$G,4,FALSE)","v":{"$error":"#N/A"}},{"$f":"G42+FieldBeeForm!$E$11","v":12},{"$error":"#N/A"},{"$f":"(VLOOKUP($F42,VegTypeParameters!A:G,6,FALSE))","v":{"$error":"#N/A"}},{"$f":"(VLOOKUP($F42,VegTypeParameters!A:G,7,FALSE))","v":{"$error":"#N/A"}},{"$error":"#N/A"},null,{"$error":"#N/A"},{"$error":"#N/A"},{"$error":"#N/A"},{"$error":"#N/A"},{"$error":"#N/A"},{"$f":"VLOOKUP($F42,VegTypeParameters!$A:$H,8,FALSE)","v":{"$error":"#N/A"}},".",".",".","."]
[1,35,2200,0,null,null,null,{"$f":"VLOOKUP(F43,VegTypeParameters!A:G,2,FALSE)","v":{"$error":"#N/A"}},{"$f":"VLOOKUP($F43,VegTypeParameters!$A:$G,5,FALSE)","v":{"$error":"#N/A"}},{"$f":"VLOOKUP($F43,VegTypeParameters!$A:$G,4,FALSE)","v":{"$error":"#N/A"}},{"$f":"G43+FieldBeeForm!$E$11","v":12},{"$f":"IF(J43>0,J43*(1-EXP(-I43*K43/J43)), 0)","v":{"$error":"#N/A"}},{"$f":"(VLOOKUP($F43,VegTypeParameters!A:G,6,FALSE))","v":{"$error":"#N/A"}},{"$f":"(VLOOKUP($F43,VegTypeParameters!A:G,7,FALSE))","v":{"$error":"#N/A"}},{"$f":"IF(M43>0, (M43*(1-EXP(-N43*G43/M43)))*(M43*(1-EXP(-N43*G43/M43))),0)","v":{"$error":"#N/A"}},null,{"$f":"IF(O43>0, (D43*E43)/O43,0)","v":{"$error":"#N/A"}},{"$f":"IF(M43>0, (M43*(1-EXP(-N43*K43/M43)))*(M43*(1-EXP(-N43*K43/M43))), 0)","v":{"$error":"#N/A"}},{"$f":"IF(M43>0,(M43*(1-EXP(-N43*K43/M43)))*L43,0)","v":{"$error":"#N/A"}},{"$f":"R43*Q43","v":{"$error":"#N/A"}},{"$f":"S43*Q43","v":{"$error":"#N/A"}},{"$f":"VLOOKUP($F43,VegTypeParameters!$A:$H,8,FALSE)","v":{"$error":"#N/A"}},".",".",".","."]
[null,null,null,"Horizontal extent of pollinator plant cover (m2) per season",null,null,null,"Vertical extent of pollinator plant cover (m2) per season",null,null,null,"Number of different pollinator plant species per season",null,null," "]
["Map Unit #","Vegetation Entry",null,"Spatial extent of Veg Type (m2)","Early","Mid","Late","Spatial extent of Veg Type (m2)","Early","Mid","Late","Early","Mid","Late"]
[{"$f":"A9","v":1},{"$f":"B9","v":1},null,{"$f":"+IF(ISNA(VLOOKUP(B46,B$9:D$43, 3, FALSE)),0,VLOOKUP(B46,B$9:D$43, 3, FALSE))","v":12.263195999999999},{"$f":"+IF(SUMIFS($T$9:$T$43, $B$9:$B$43, $B46, $V$9:$V$43, \"*\"&\"Early\"&\"*\") <=$D46, SUMIFS($T$9:$T$43, $B$9:$B$43, $B46, $V$9:$V$43, \"*\"&\"Early\"&\"*\"), $D46)","v":0},{"$f":"+IF(SUMIFS($T$9:$T$43, $B$9:$B$43, $B46, $V$9:$V$43, \"*\"&\"Mid\"&\"*\") <=$D46, SUMIFS($T$9:$T$43, $B$9:$B$43, $B46, $V$9:$V$43, \"*\"&\"Mid\"&\"*\"), $D46)","v":0.73699402555497884},{"$f":"+IF(SUMIFS($T$9:$T$43, $B$9:$B$43, $B46, $V$9:$V$43, \"*\"&\"Late\"&\"*\") <=$D46, SUMIFS($T$9:$T$43, $B$9:$B$43, $B46, $V$9:$V$43, \"*\"&\"Late\"&\"*\"), $D46)","v":0.73699402555497884},{"$f":"+IF(ISNA(VLOOKUP(B46,B$9:D$43, 3, FALSE)),0,VLOOKUP(B46,B$9:D$43, 3, FALSE))","v":12.263195999999999},{"$f":"+IF(SUMIFS($U$9:$U$43, $B$9:$B$43, $B46, $V$9:$V$43, \"*\"&\"Early\"&\"*\") <=$D46, SUMIFS($U$9:$U$43, $B$9:$B$43, $B46, $V$9:$V$43, \"*\"&\"Early\"&\"*\"), $D46)","v":0},{"$f":"+IF(SUMIFS($U$9:$U$43, $B$9:$B$43, $B46, $V$9:$V$43, \"*\"&\"Mid\"&\"*\") <=$D46, SUMIFS($U$9:$U$43, $B$9:$B$43, $B46, $V$9:$V$43, \"*\"&\"Mid\"&\"*\"), $D46)","v":0.44219641193170622},{"$f":"+IF(SUMIFS($U$9:$U$43, $B$9:$B$43, $B46, $V$9:$V$43, \"*\"&\"Late\"&\"*\") <=$D46, SUMIFS($U$9:$U$43, $B$9:$B$43, $B46, $V$9:$V$43, \"*\"&\"Late\"&\"*\"), $D46)","v":0.44219641193170622}," "]
[{"$f":"A10","v":1},2,null,{"$f":"+IF(ISNA(VLOOKUP(B47,B$9:D$43, 3, FALSE)),0,VLOOKUP(B47,B$9:D$43, 3, FALSE))","v":6.1315979999999994},0,0.18645208359769186,0.18645208359769186,{"$f":"+IF(ISNA(VLOOKUP(B47,B$9:D$43, 3, FALSE)),0,VLOOKUP(B47,B$9:D$43, 3, FALSE))","v":6.1315979999999994},0,0.62150694533427098,0.62150694533427098," "]
[{"$f":"A11","v":1},3,null,16.350928,0,1.7494336791562461,1.7494336791562461,16.350928,0,2.186792098945308,2.186792098945308]
[{"$f":"A12","v":1},4,null,16.350928,5.1979101831221239,0,0,16.350928,7.2249612474426836,0,0]
[{"$f":"A13","v":1},5,null,16.350928,0,0,0,16.350928,0,0,0]
[{"$f":"A14","v":1},6,null,16.350928,0,1.4487393433861524,1.4487393433861524,16.350928,0,1.0348138167043945,1.0348138167043945]
[{"$f":"A15","v":1},7,null,16.350928,0,1.345561772334019,1.345561772334019,16.350928,0,0.80733700770344108,0.80733700770344108]
[{"$f":"A16","v":1},8,null,6.1315979999999994,0.20372897016367764,0.20372897016367764,0,6.1315979999999994,0.81491588065471054,0.81491588065471054,0]
[{"$f":"A17","v":1},9,null,6.1315979999999994,0,0,0,6.1315979999999994,0,0,0]
[{"$f":"A18","v":1},10,null,6.1315979999999994,0,0,0.30445132613644244,6.1315979999999994,0,0,0.59491167079241514]
[{"$f":"A19","v":1},11,null,{"$f":"+IF(ISNA(VLOOKUP(B56,B$9:D$43, 3, FALSE)),0,VLOOKUP(B56,B$9:D$43, 3, FALSE))","v":6.1315979999999994},0.20372897016367766,0.20372897016367766,0,{"$f":"+IF(ISNA(VLOOKUP(B56,B$9:D$43, 3, FALSE)),0,VLOOKUP(B56,B$9:D$43, 3, FALSE))","v":6.1315979999999994},0.81491588065471066,0.81491588065471066,0]
[{"$f":"A20","v":1},12,null,16.350928,2.9722164985770521,2.9722164985770521,2.9722164985770521,16.350928,2.9634683863534645,2.9634683863534645,2.9634683863534645]
[{"$f":"A21","v":1},13,null,16.350928,13.609661957493358,0,0,16.350928,16.350928,0,0]
[{"$f":"A22","v":1},14,null,6.1315979999999994,0.18396464358461501,0.18396464358461501,0,6.1315979999999994,0.36792928716923001,0.36792928716923001,0]
[{"$f":"A23","v":1},15,null,6.1315979999999994,0,0,0,6.1315979999999994,0,0,0]
[{"$f":"A24","v":1},16,null,16.350928,0,1.3145832149321708,0,16.350928,0,2.6291664298643416,0]
[{"$f":"A25","v":1},17,null,16.350928,1.4487393433861526,1.4487393433861526,1.4487393433861526,16.350928,5.7949573735446105,5.7949573735446105,5.7949573735446105]
[{"$f":"A26","v":1},18,null,1.021933,0,8.8738480329406278E-3,8.8738480329406278E-3,1.021933,0,5.3243055365967441E-3,5.3243055365967441E-3]
[{"$f":"A27","v":1},19,null,0,0,0,0,0,0,0,0]
[{"$f":"A28","v":1},20,null,0,0,0,0,0,0,0,0]
[{"$f":"A29","v":1},21,null,0,0,0,0,0,0,0,0]
[{"$f":"A30","v":1},22,null,0,0,0,0,0,0,0,0]
[{"$f":"A31","v":1},23,null,0,0,0,0,0,0,0,0]
[{"$f":"A32","v":1},24,null,0,0,0,0,0,0,0,0]
[{"$f":"A33","v":1},25,null,0,0,0,0,0,0,0,0]
[{"$f":"A34","v":1},26,null,0,0,0,0,0,0,0,0]
[{"$f":"A35","v":1},27,null,0,0,0,0,0,0,0,0]
[{"$f":"A36","v":1},28,null,0,0,0,0,0,0,0,0]
[{"$f":"A37","v":1},29,null,0,0,0,0,0,0,0,0]
[{"$f":"A38","v":1},30,null,0,0,0,0,0,0,0,0]
[{"$f":"A39","v":1},31,null,0,0,0,0,0,0,0,0]
[{"$f":"A40","v":1},32,null,0,0,0,0,0,0,0,0]
[{"$f":"A41","v":1},33,null,0,0,0,0,0,0,0,0]
[{"$f":"A42","v":1},34,null,0,0,0,0,0,0,0,0]
[{"$f":"A43","v":1},35,null,0,0,0,0,0,0,0,0]
[{"$f":"A9","v":1},"Total",null,{"$f":"+SUM(D46:D80)","v":203.364667},{"$f":"+SUM(E46:E80)","v":23.819950566490657},11.803016392869374,10.201461920161677,203.364667,34.332076055819407,18.483323824396784,14.451308016846207,{"$f":"+X8","v":7},{"$f":"+Y8","v":10},{"$f":"+Z8","v":7}]
[null," ",null,{"$f":"D81","v":203.364667},"Map Unit Size in Acres",null,{"$f":"FieldBeeForm!E14","v":13190},"Value entered in FieldBeeForm (Should be same as cell C57)"]
["Enter only in yellow cells. Leave rest untouched.",null,null,null,null,null,"Enter the current year age in column G for each vegetation type. This age will be added to the assessment year (input on Field data form) to determine time series age in column K. If you are interested in just the current effects, enter a '0' in cell E11 of the Field data form."]
[]
["Map Unit","Vegetation Entry","Map Unit Size","Spatial extent of Veg Type","Existing Cover Class for VegType","Species/ VegType","Existing Age of Average Plant \n(for S enter 1, for Sa enter 2, for P enter 3, for M enter 5, for D enter 10)","Species/Vegetation Type Descriptions","Ht Rate","Ht max","Future Age","Future Height","Canopy Width Max (m)","Canopy Width Rate","Existing Age canopy area per plant",null,"Estimated # Individuals","Future Horizontal Surface Area per plant (width x width)","Future Vertical Surface Area per plant (width x height)","Horizontal Surface Area Across Map Unit","Vertical Surface Area Across Map Unit","Season(s)","Season(s) (.)","Early","Mid","Late"]
["#","#"," sq ft","m2","%","code","yrs",null,"m/yr","m","yrs","m","m","m/yr","m2",null,"number","m2","m2","m2","m2",null,null,{"$f":"SUM(IF(FREQUENCY(MATCH(X87:X121, X87:X121,0),MATCH(X87:X121, X87:X121,0))>0,1))-1","v":7},{"$f":"SUM(IF(FREQUENCY(MATCH(Y87:Y121, Y87:Y121,0),MATCH(Y87:Y121, Y87:Y121,0))>0,1))-1","v":10},{"$f":"SUM(IF(FREQUENCY(MATCH(Z87:Z121, Z87:Z121,0),MATCH(Z87:Z121, Z87:Z121,0))>0,1))-1","v":7}]
[2,1,null,{"$f":"(0.092903*C87)*E87","v":0},0.06,1600,5,{"$f":"VLOOKUP(F87,VegTypeParameters!A:G,2,FALSE)","v":"Atriplex"},{"$f":"VLOOKUP($F87,VegTypeParameters!$A:$G,5,FALSE)","v":3.2962962962962963},{"$f":"VLOOKUP($F87,VegTypeParameters!$A:$G,4,FALSE)","v":3},{"$f":"G87+FieldBeeForm!$E$11","v":17},{"$f":"IF(J87>0,J87*(1-EXP(-I87*K87/J87)), 0)","v":2.9999999768298276},{"$f":"(VLOOKUP($F87,VegTypeParameters!A:G,6,FALSE))","v":5},{"$f":"(VLOOKUP($F87,VegTypeParameters!A:G,7,FALSE))","v":7.1111111111111107},{"$f":"IF(M87>0, (M87*(1-EXP(-N87*G87/M87)))*(M87*(1-EXP(-N87*G87/M87))),0)","v":24.959217254150069},null,{"$f":"IF(O87>0, (D87*E87)/O87,0)","v":0},{"$f":"IF(M87>0, (M87*(1-EXP(-N87*K87/M87)))*(M87*(1-EXP(-N87*K87/M87))), 0)","v":24.99999999841986},{"$f":"IF(M87>0,(M87*(1-EXP(-N87*K87/M87)))*L87,0)","v":14.999999883675097},{"$f":"R87*Q87","v":0},{"$f":"S87*Q87","v":0},{"$f":"VLOOKUP($F87,VegTypeParameters!$A:$H,8,FALSE)","v":"Mid/Late"},{"$f":"+IF(ISNA(V87), \".\",  V87)","v":"Mid/Late"},{"$f":"IF($W87=\"Early/Mid\",$H87,IF($W87=\"Early\", $H87, IF($W87=\"Early/Mid/Late\", $H87,\".\")))","v":"."},{"$f":"IF($W87=\"Early/Mid\",$H87,IF($W87=\"Mid\", $H87, IF($W87=\"Mid/Late\", $H87, IF($W87=\"Early/Mid/Late\", $H87,\".\"))))","v":"Atriplex"},{"$f":"IF($W87=\"Mid/Late\",$H87,IF($W87=\"Late\", $H87, IF($W87=\"Early/Mid/Late\", $H87,\".\")))","v":"Atriplex"}]
[2,2,{"$f":"C$87","v":0},{"$f":"(0.092903*C88)*E88","v":0},0.03,4200,3,{"$f":"VLOOKUP(F88,VegTypeParameters!A:G,2,FALSE)","v":"Helianthus"},{"$f":"VLOOKUP($F88,VegTypeParameters!$A:$G,5,FALSE)","v":6.5},{"$f":"VLOOKUP($F88,VegTypeParameters!$A:$G,4,FALSE)","v":2.5},{"$f":"G88+FieldBeeForm!$E$11","v":15},2.5,{"$f":"(VLOOKUP($F88,VegTypeParameters!A:G,6,FALSE))","v":0.75},{"$f":"(VLOOKUP($F88,VegTypeParameters!A:G,7,FALSE))","v":1.25},0.55494534708652032,null,0,0.56249999998437616,1.8749999999739604,0,0,{"$f":"VLOOKUP($F88,VegTypeParameters!$A:$H,8,FALSE)","v":"Mid/Late"},{"$f":"+IF(ISNA(V88), \".\",  V88)","v":"Mid/Late"},{"$f":"IF($W88=\"Early/Mid\",$H88,IF($W88=\"Early\", $H88, IF($W88=\"Early/Mid/Late\", $H88,\".\")))","v":"."},{"$f":"IF($W88=\"Early/Mid\",$H88,IF($W88=\"Mid\", $H88, IF($W88=\"Mid/Late\", $H88, IF($W88=\"Early/Mid/Late\", $H88,\".\"))))","v":"Helianthus"},{"$f":"IF($W88=\"Mid/Late\",$H88,IF($W88=\"Late\", $H88, IF($W88=\"Early/Mid/Late\", $H88,\".\")))","v":"Helianthus"}]
[2,3,{"$f":"C$87","v":0},0,0.08,4000,3,{"$f":"VLOOKUP(F89,VegTypeParameters!A:G,2,FALSE)","v":"Grindelia"},{"$f":"VLOOKUP($F89,VegTypeParameters!$A:$G,5,FALSE)","v":1.6666666666666667},{"$f":"VLOOKUP($F89,VegTypeParameters!$A:$G,4,FALSE)","v":2.5},{"$f":"G89+FieldBeeForm!$E$11","v":15},2.4998865001755939,{"$f":"(VLOOKUP($F89,VegTypeParameters!A:G,6,FALSE))","v":2},{"$f":"(VLOOKUP($F89,VegTypeParameters!A:G,7,FALSE))","v":1.3333333333333333},2.9905802896620353,null,0,3.9996368088065144,4.9995460110081433,0,0,{"$f":"VLOOKUP($F89,VegTypeParameters!$A:$H,8,FALSE)","v":"Mid/Late"},"Mid/Late",".","Grindelia","Grindelia"]
[2,4,0,0,0.08,7000,3,{"$f":"VLOOKUP(F90,VegTypeParameters!A:G,2,FALSE)","v":"Salix (shrub)"},{"$f":"VLOOKUP($F90,VegTypeParameters!$A:$G,5,FALSE)","v":0.73},{"$f":"VLOOKUP($F90,VegTypeParameters!$A:$G,4,FALSE)","v":3.5},{"$f":"G90+FieldBeeForm!$E$11","v":15},3.3467689644197414,{"$f":"(VLOOKUP($F90,VegTypeParameters!A:G,6,FALSE))","v":2.5},{"$f":"(VLOOKUP($F90,VegTypeParameters!A:G,7,FALSE))","v":0.55000000000000004},1.4589539561403246,null,0,5.7974627077191743,8.0583238111294335,0,0,{"$f":"VLOOKUP($F90,VegTypeParameters!$A:$H,8,FALSE)","v":"Early"},"Early","Salix (shrub)",".","."]
[2,5,0,0,0.08,8400,5,{"$f":"VLOOKUP(F91,VegTypeParameters!A:G,2,FALSE)","v":"Weeds, non-invasive and not beneficial to pollinators"},{"$f":"VLOOKUP($F91,VegTypeParameters!$A:$G,5,FALSE)","v":0},{"$f":"VLOOKUP($F91,VegTypeParameters!$A:$G,4,FALSE)","v":0},{"$f":"G91+FieldBeeForm!$E$11","v":17},0,{"$f":"(VLOOKUP($F91,VegTypeParameters!A:G,6,FALSE))","v":0},{"$f":"(VLOOKUP($F91,VegTypeParameters!A:G,7,FALSE))","v":0},0,null,0,0,0,0,0,{"$f":"VLOOKUP($F91,VegTypeParameters!$A:$H,8,FALSE)","v":"Never"},"Never",".",".","."]
[2,6,0,0,0.08,5300,3,{"$f":"VLOOKUP(F92,VegTypeParameters!A:G,2,FALSE)","v":"Medicago "},{"$f":"VLOOKUP($F92,VegTypeParameters!$A:$G,5,FALSE)","v":0.5},{"$f":"VLOOKUP($F92,VegTypeParameters!$A:$G,4,FALSE)","v":0.5},{"$f":"G92+FieldBeeForm!$E$11","v":15},0.49999984704883976,{"$f":"(VLOOKUP($F92,VegTypeParameters!A:G,6,FALSE))","v":0.7},{"$f":"(VLOOKUP($F92,VegTypeParameters!A:G,7,FALSE))","v":0.7},0.44242326156605982,null,0,0.48999970021577172,0.34999978586840841,0,0,{"$f":"VLOOKUP($F92,VegTypeParameters!$A:$H,8,FALSE)","v":"Mid/Late"},"Mid/Late",".","Medicago ","Medicago "]
[2,7,0,0,0.08,1600,3,{"$f":"VLOOKUP(F93,VegTypeParameters!A:G,2,FALSE)","v":"Atriplex"},{"$f":"VLOOKUP($F93,VegTypeParameters!$A:$G,5,FALSE)","v":3.2962962962962963},{"$f":"VLOOKUP($F93,VegTypeParameters!$A:$G,4,FALSE)","v":3},{"$f":"G93+FieldBeeForm!$E$11","v":15},2.999999791404568,{"$f":"(VLOOKUP($F93,VegTypeParameters!A:G,6,FALSE))","v":5},{"$f":"(VLOOKUP($F93,VegTypeParameters!A:G,7,FALSE))","v":7.1111111111111107},24.303496604054391,null,0,24.999999972834292,14.999998948873127,0,0,{"$f":"VLOOKUP($F93,VegTypeParameters!$A:$H,8,FALSE)","v":"Mid/Late"},"Mid/Late",".","Atriplex","Atriplex"]
[2,8,0,0,0.03,7500,3,{"$f":"VLOOKUP(F94,VegTypeParameters!A:G,2,FALSE)","v":"Scrophularia"},{"$f":"VLOOKUP($F94,VegTypeParameters!$A:$G,5,FALSE)","v":1.2},{"$f":"VLOOKUP($F94,VegTypeParameters!$A:$G,4,FALSE)","v":1.2},{"$f":"G94+FieldBeeForm!$E$11","v":15},1.1999996329172153,{"$f":"(VLOOKUP($F94,VegTypeParameters!A:G,6,FALSE))","v":0.3},{"$f":"(VLOOKUP($F94,VegTypeParameters!A:G,7,FALSE))","v":0.3},8.1261415389684455E-2,null,0,8.9999944937590726E-2,0.3599997797503629,0,0,{"$f":"VLOOKUP($F94,VegTypeParameters!$A:$H,8,FALSE)","v":"Early/Mid"},"Early/Mid","Scrophularia","Scrophularia","."]
[2,9,0,0,0.03,3500,3,{"$f":"VLOOKUP(F95,VegTypeParameters!A:G,2,FALSE)","v":"Ficus carica"},{"$f":"VLOOKUP($F95,VegTypeParameters!$A:$G,5,FALSE)","v":0},{"$f":"VLOOKUP($F95,VegTypeParameters!$A:$G,4,FALSE)","v":0},{"$f":"G95+FieldBeeForm!$E$11","v":15},0,{"$f":"(VLOOKUP($F95,VegTypeParameters!A:G,6,FALSE))","v":0},{"$f":"(VLOOKUP($F95,VegTypeParameters!A:G,7,FALSE))","v":0},0,null,0,0,0,0,0,{"$f":"VLOOKUP($F95,VegTypeParameters!$A:$H,8,FALSE)","v":"Never"},"Never",".",".","."]
[2,10,0,0,0.03,6200,3,{"$f":"VLOOKUP(F96,VegTypeParameters!A:G,2,FALSE)","v":"Other late blooming native plants beneficial to pollinators"},{"$f":"VLOOKUP($F96,VegTypeParameters!$A:$G,5,FALSE)","v":0.25},{"$f":"VLOOKUP($F96,VegTypeParameters!$A:$G,4,FALSE)","v":1},{"$f":"G96+FieldBeeForm!$E$11","v":15},0.97648225414399092,{"$f":"(VLOOKUP($F96,VegTypeParameters!A:G,6,FALSE))","v":0.5},{"$f":"(VLOOKUP($F96,VegTypeParameters!A:G,7,FALSE))","v":0.25},0.15088168701775109,null,0,0.24972353429050623,0.48797108853574861,0,0,{"$f":"VLOOKUP($F96,VegTypeParameters!$A:$H,8,FALSE)","v":"Late"},"Late",".",".","Other late blooming native plants beneficial to pollinators"]
[2,11,0,0,0.03,2500,3,{"$f":"VLOOKUP(F97,VegTypeParameters!A:G,2,FALSE)","v":"Clarkia"},{"$f":"VLOOKUP($F97,VegTypeParameters!$A:$G,5,FALSE)","v":0.4},{"$f":"VLOOKUP($F97,VegTypeParameters!$A:$G,4,FALSE)","v":0.4},{"$f":"G97+FieldBeeForm!$E$11","v":15},0.39999987763907185,{"$f":"(VLOOKUP($F97,VegTypeParameters!A:G,6,FALSE))","v":0.1},{"$f":"(VLOOKUP($F97,VegTypeParameters!A:G,7,FALSE))","v":0.1},9.029046154409387E-3,null,0,9.9999938819545289E-3,3.9999975527818116E-2,0,0,{"$f":"VLOOKUP($F97,VegTypeParameters!$A:$H,8,FALSE)","v":"Early/Mid"},"Early/Mid","Clarkia","Clarkia","."]
[2,12,0,0,0.08,5000,3,{"$f":"VLOOKUP(F98,VegTypeParameters!A:G,2,FALSE)","v":"Lupinus spp."},{"$f":"VLOOKUP($F98,VegTypeParameters!$A:$G,5,FALSE)","v":0.98000000000000009},{"$f":"VLOOKUP($F98,VegTypeParameters!$A:$G,4,FALSE)","v":3},{"$f":"G98+FieldBeeForm!$E$11","v":15},2.9776602507872267,{"$f":"(VLOOKUP($F98,VegTypeParameters!A:G,6,FALSE))","v":3},{"$f":"(VLOOKUP($F98,VegTypeParameters!A:G,7,FALSE))","v":1.08},3.925206627733659,null,0,8.9188851385636738,8.8926342217348378,0,0,{"$f":"VLOOKUP($F98,VegTypeParameters!$A:$H,8,FALSE)","v":"Early/Mid/Late"},"Early/Mid/Late","Lupinus spp.","Lupinus spp.","Lupinus spp."]
[2,13,0,0,0.08,6000,3,{"$f":"VLOOKUP(F99,VegTypeParameters!A:G,2,FALSE)","v":"Orchard"},{"$f":"VLOOKUP($F99,VegTypeParameters!$A:$G,5,FALSE)","v":0.5},{"$f":"VLOOKUP($F99,VegTypeParameters!$A:$G,4,FALSE)","v":10},{"$f":"G99+FieldBeeForm!$E$11","v":15},5.2763344725898529,{"$f":"(VLOOKUP($F99,VegTypeParameters!A:G,6,FALSE))","v":6},{"$f":"(VLOOKUP($F99,VegTypeParameters!A:G,7,FALSE))","v":0.5},1.7614473685136525,null,0,18.326714576526665,22.58783601812447,0,0,{"$f":"VLOOKUP($F99,VegTypeParameters!$A:$H,8,FALSE)","v":"Early"},"Early","Orchard",".","."]
[2,14,0,0,0.03,3300,5,{"$f":"VLOOKUP(F100,VegTypeParameters!A:G,2,FALSE)","v":"Eschscholzia"},{"$f":"VLOOKUP($F100,VegTypeParameters!$A:$G,5,FALSE)","v":0.6},{"$f":"VLOOKUP($F100,VegTypeParameters!$A:$G,4,FALSE)","v":0.3},{"$f":"G100+FieldBeeForm!$E$11","v":17},0.29999999999999949,{"$f":"(VLOOKUP($F100,VegTypeParameters!A:G,6,FALSE))","v":0.15},{"$f":"(VLOOKUP($F100,VegTypeParameters!A:G,7,FALSE))","v":0.3},2.2497957049536645E-2,null,0,2.2499999999999923E-2,4.4999999999999846E-2,0,0,{"$f":"VLOOKUP($F100,VegTypeParameters!$A:$H,8,FALSE)","v":"Early/Mid"},"Early/Mid","Eschscholzia","Eschscholzia","."]
[2,15,0,0,0.03,5600,3,{"$f":"VLOOKUP(F101,VegTypeParameters!A:G,2,FALSE)","v":"Native forbs and graminoids not beneficial to pollinators"},{"$f":"VLOOKUP($F101,VegTypeParameters!$A:$G,5,FALSE)","v":0},{"$f":"VLOOKUP($F101,VegTypeParameters!$A:$G,4,FALSE)","v":0},{"$f":"G101+FieldBeeForm!$E$11","v":15},{"$f":"IF(J101>0,J101*(1-EXP(-I101*K101/J101)), 0)","v":0},{"$f":"(VLOOKUP($F101,VegTypeParameters!A:G,6,FALSE))","v":0},{"$f":"(VLOOKUP($F101,VegTypeParameters!A:G,7,FALSE))","v":0},{"$f":"IF(M101>0, (M101*(1-EXP(-N101*G101/M101)))*(M101*(1-EXP(-N101*G101/M101))),0)","v":0},null,{"$f":"IF(O101>0, (D101*E101)/O101,0)","v":0},{"$f":"IF(M101>0, (M101*(1-EXP(-N101*K101/M101)))*(M101*(1-EXP(-N101*K101/M101))), 0)","v":0},{"$f":"IF(M101>0,(M101*(1-EXP(-N101*K101/M101)))*L101,0)","v":0},0,0,{"$f":"VLOOKUP($F101,VegTypeParameters!$A:$H,8,FALSE)","v":"Never"},"Never",".",".","."]
[2,16,0,0,0.08,3800,3,{"$f":"VLOOKUP(F102,VegTypeParameters!A:G,2,FALSE)","v":"Gilia"},{"$f":"VLOOKUP($F102,VegTypeParameters!$A:$G,5,FALSE)","v":0.6},{"$f":"VLOOKUP($F102,VegTypeParameters!$A:$G,4,FALSE)","v":0.3},{"$f":"G102+FieldBeeForm!$E$11","v":15},{"$f":"IF(J102>0,J102*(1-EXP(-I102*K102/J102)), 0)","v":0.2999999999999719},{"$f":"(VLOOKUP($F102,VegTypeParameters!A:G,6,FALSE))","v":0.15},{"$f":"(VLOOKUP($F102,VegTypeParameters!A:G,7,FALSE))","v":0.3},{"$f":"IF(M102>0, (M102*(1-EXP(-N102*G102/M102)))*(M102*(1-EXP(-N102*G102/M102))),0)","v":2.2388594396827964E-2},null,{"$f":"IF(O102>0, (D102*E102)/O102,0)","v":0},{"$f":"IF(M102>0, (M102*(1-EXP(-N102*K102/M102)))*(M102*(1-EXP(-N102*K102/M102))), 0)","v":2.2499999999995784E-2},{"$f":"IF(M102>0,(M102*(1-EXP(-N102*K102/M102)))*L102,0)","v":4.4999999999991568E-2},0,0,{"$f":"VLOOKUP($F102,VegTypeParameters!$A:$H,8,FALSE)","v":"Mid"},"Mid",".","Gilia","."]
[2,17,0,0,0.08,1500,3,{"$f":"VLOOKUP(F103,VegTypeParameters!A:G,2,FALSE)","v":"Asclepias"},{"$f":"VLOOKUP($F103,VegTypeParameters!$A:$G,5,FALSE)","v":0.8},{"$f":"VLOOKUP($F103,VegTypeParameters!$A:$G,4,FALSE)","v":0.8},{"$f":"G103+FieldBeeForm!$E$11","v":15},0.79999975527814371,{"$f":"(VLOOKUP($F103,VegTypeParameters!A:G,6,FALSE))","v":0.2},{"$f":"(VLOOKUP($F103,VegTypeParameters!A:G,7,FALSE))","v":0.2},3.6116184617637548E-2,null,0,3.9999975527818116E-2,0.15999990211127246,0,0,{"$f":"VLOOKUP($F103,VegTypeParameters!$A:$H,8,FALSE)","v":"Early/Mid/Late"},"Early/Mid/Late","Asclepias","Asclepias","Asclepias"]
[2,18,0,0,5.0000000000000001E-3,1600,1,{"$f":"VLOOKUP(F104,VegTypeParameters!A:G,2,FALSE)","v":"Atriplex"},{"$f":"VLOOKUP($F104,VegTypeParameters!$A:$G,5,FALSE)","v":3.2962962962962963},{"$f":"VLOOKUP($F104,VegTypeParameters!$A:$G,4,FALSE)","v":3},{"$f":"G104+FieldBeeForm!$E$11","v":13},2.9999981220660135,{"$f":"(VLOOKUP($F104,VegTypeParameters!A:G,6,FALSE))","v":5},{"$f":"(VLOOKUP($F104,VegTypeParameters!A:G,7,FALSE))","v":7.1111111111111107},14.395290762184326,null,0,24.999999532966985,14.999990470220251,0,0,{"$f":"VLOOKUP($F104,VegTypeParameters!$A:$H,8,FALSE)","v":"Mid/Late"},"Mid/Late",".","Atriplex","Atriplex"]
[2,19,0,0,null,null,null,{"$f":"VLOOKUP(F105,VegTypeParameters!A:G,2,FALSE)","v":{"$error":"#N/A"}},{"$f":"VLOOKUP($F105,VegTypeParameters!$A:$G,5,FALSE)","v":{"$error":"#N/A"}},{"$f":"VLOOKUP($F105,VegTypeParameters!$A:$G,4,FALSE)","v":{"$error":"#N/A"}},{"$f":"G105+FieldBeeForm!$E$11","v":12},{"$error":"#N/A"},{"$f":"(VLOOKUP($F105,VegTypeParameters!A:G,6,FALSE))","v":{"$error":"#N/A"}},{"$f":"(VLOOKUP($F105,VegTypeParameters!A:G,7,FALSE))","v":{"$error":"#N/A"}},{"$error":"#N/A"},null,{"$error":"#N/A"},{"$error":"#N/A"},{"$error":"#N/A"},{"$error":"#N/A"},{"$error":"#N/A"},{"$f":"VLOOKUP($F105,VegTypeParameters!$A:$H,8,FALSE)","v":{"$error":"#N/A"}},".",".",".","."]
[2,20,0,0,null,null,null,{"$f":"VLOOKUP(F106,VegTypeParameters!A:G,2,FALSE)","v":{"$error":"#N/A"}},{"$f":"VLOOKUP($F106,VegTypeParameters!$A:$G,5,FALSE)","v":{"$error":"#N/A"}},{"$f":"VLOOKUP($F106,VegTypeParameters!$A:$G,4,FALSE)","v":{"$error":"#N/A"}},{"$f":"G106+FieldBeeForm!$E$11","v":12},{"$error":"#N/A"},{"$f":"(VLOOKUP($F106,VegTypeParameters!A:G,6,FALSE))","v":{"$error":"#N/A"}},{"$f":"(VLOOKUP($F106,VegTypeParameters!A:G,7,FALSE))","v":{"$error":"#N/A"}},{"$error":"#N/A"},null,{"$error":"#N/A"},{"$error":"#N/A"},{"$error":"#N/A"},{"$error":"#N/A"},{"$error":"#N/A"},{"$f":"VLOOKUP($F106,VegTypeParameters!$A:$H,8,FALSE)","v":{"$error":"#N/A"}},".",".",".","."]
[2,21,0,0,null,null,null,{"$f":"VLOOKUP(F107,VegTypeParameters!A:G,2,FALSE)","v":{"$error":"#N/A"}},{"$f":"VLOOKUP($F107,VegTypeParameters!$A:$G,5,FALSE)","v":{"$error":"#N/A"}},{"$f":"VLOOKUP($F107,VegTypeParameters!$A:$G,4,FALSE)","v":{"$error":"#N/A"}},{"$f":"G107+FieldBeeForm!$E$11","v":12},{"$error":"#N/A"},{"$f":"(VLOOKUP($F107,VegTypeParameters!A:G,6,FALSE))","v":{"$error":"#N/A"}},{"$f":"(VLOOKUP($F107,VegTypeParameters!A:G,7,FALSE))","v":{"$error":"#N/A"}},{"$error":"#N/A"},null,{"$error":"#N/A"},{"$error":"#N/A"},{"$error":"#N/A"},{"$error":"#N/A"},{"$error":"#N/A"},{"$f":"VLOOKUP($F107,VegTypeParameters!$A:$H,8,FALSE)","v":{"$error":"#N/A"}},".",".",".","."]
[2,22,0,0,null,null,null,{"$f":"VLOOKUP(F108,VegTypeParameters!A:G,2,FALSE)","v":{"$error":"#N/A"}},{"$f":"VLOOKUP($F108,VegTypeParameters!$A:$G,5,FALSE)","v":{"$error":"#N/A"}},{"$f":"VLOOKUP($F108,VegTypeParameters!$A:$G,4,FALSE)","v":{"$error":"#N/A"}},{"$f":"G108+FieldBeeForm!$E$11","v":12},{"$error":"#N/A"},{"$f":"(VLOOKUP($F108,VegTypeParameters!A:G,6,FALSE))","v":{"$error":"#N/A"}},{"$f":"(VLOOKUP($F108,VegTypeParameters!A:G,7,FALSE))","v":{"$error":"#N/A"}},{"$error":"#N/A"},null,{"$error":"#N/A"},{"$error":"#N/A"},{"$error":"#N/A"},{"$error":"#N/A"},{"$error":"#N/A"},{"$f":"VLOOKUP($F108,VegTypeParameters!$A:$H,8,FALSE)","v":{"$error":"#N/A"}},".",".",".","."]
[2,23,0,0,null,null,null,{"$f":"VLOOKUP(F109,VegTypeParameters!A:G,2,FALSE)","v":{"$error":"#N/A"}},{"$f":"VLOOKUP($F109,VegTypeParameters!$A:$G,5,FALSE)","v":{"$error":"#N/A"}},{"$f":"VLOOKUP($F109,VegTypeParameters!$A:$G,4,FALSE)","v":{"$error":"#N/A"}},{"$f":"G109+FieldBeeForm!$E$11","v":12},{"$error":"#N/A"},{"$f":"(VLOOKUP($F109,VegTypeParameters!A:G,6,FALSE))","v":{"$error":"#N/A"}},{"$f":"(VLOOKUP($F109,VegTypeParameters!A:G,7,FALSE))","v":{"$error":"#N/A"}},{"$error":"#N/A"},null,{"$error":"#N/A"},{"$error":"#N/A"},{"$error":"#N/A"},{"$error":"#N/A"},{"$error":"#N/A"},{"$f":"VLOOKUP($F109,VegTypeParameters!$A:$H,8,FALSE)","v":{"$error":"#N/A"}},".",".",".","."]
[2,24,0,0,null,null,null,{"$f":"VLOOKUP(F110,VegTypeParameters!A:G,2,FALSE)","v":{"$error":"#N/A"}},{"$f":"VLOOKUP($F110,VegTypeParameters!$A:$G,5,FALSE)","v":{"$error":"#N/A"}},{"$f":"VLOOKUP($F110,VegTypeParameters!$A:$G,4,FALSE)","v":{"$error":"#N/A"}},{"$f":"G110+FieldBeeForm!$E$11","v":12},{"$error":"#N/A"},{"$f":"(VLOOKUP($F110,VegTypeParameters!A:G,6,FALSE))","v":{"$error":"#N/A"}},{"$f":"(VLOOKUP($F110,VegTypeParameters!A:G,7,FALSE))","v":{"$error":"#N/A"}},{"$error":"#N/A"},null,{"$error":"#N/A"},{"$error":"#N/A"},{"$error":"#N/A"},{"$error":"#N/A"},{"$error":"#N/A"},{"$f":"VLOOKUP($F110,VegTypeParameters!$A:$H,8,FALSE)","v":{"$error":"#N/A"}},".",".",".","."]
[2,25,0,0,null,null,null,{"$f":"VLOOKUP(F111,VegTypeParameters!A:G,2,FALSE)","v":{"$error":"#N/A"}},{"$f":"VLOOKUP($F111,VegTypeParameters!$A:$G,5,FALSE)","v":{"$error":"#N/A"}},{"$f":"VLOOKUP($F111,VegTypeParameters!$A:$G,4,FALSE)","v":{"$error":"#N/A"}},{"$f":"G111+FieldBeeForm!$E$11","v":12},{"$f":"IF(J111>0,J111*(1-EXP(-I111*K111/J111)), 0)","v":{"$error":"#N/A"}},{"$f":"(VLOOKUP($F111,VegTypeParameters!A:G,6,FALSE))","v":{"$error":"#N/A"}},{"$f":"(VLOOKUP($F111,VegTypeParameters!A:G,7,FALSE))","v":{"$error":"#N/A"}},{"$f":"IF(M111>0, (M111*(1-EXP(-N111*G111/M111)))*(M111*(1-EXP(-N111*G111/M111))),0)","v":{"$error":"#N/A"}},null,{"$f":"IF(O111>0, (D111*E111)/O111,0)","v":{"$error":"#N/A"}},{"$f":"IF(M111>0, (M111*(1-EXP(-N111*K111/M111)))*(M111*(1-EXP(-N111*K111/M111))), 0)","v":{"$error":"#N/A"}},{"$f":"IF(M111>0,(M111*(1-EXP(-N111*K111/M111)))*L111,0)","v":{"$error":"#N/A"}},{"$error":"#N/A"},{"$error":"#N/A"},{"$f":"VLOOKUP($F111,VegTypeParameters!$A:$H,8,FALSE)","v":{"$error":"#N/A"}},".",".",".","."]
[2,26,0,0,null,null,null,{"$f":"VLOOKUP(F112,VegTypeParameters!A:G,2,FALSE)","v":{"$error":"#N/A"}},{"$f":"VLOOKUP($F112,VegTypeParameters!$A:$G,5,FALSE)","v":{"$error":"#N/A"}},{"$f":"VLOOKUP($F112,VegTypeParameters!$A:$G,4,FALSE)","v":{"$error":"#N/A"}},{"$f":"G112+FieldBeeForm!$E$11","v":12},{"$f":"IF(J112>0,J112*(1-EXP(-I112*K112/J112)), 0)","v":{"$error":"#N/A"}},{"$f":"(VLOOKUP($F112,VegTypeParameters!A:G,6,FALSE))","v":{"$error":"#N/A"}},{"$f":"(VLOOKUP($F112,VegTypeParameters!A:G,7,FALSE))","v":{"$error":"#N/A"}},{"$f":"IF(M112>0, (M112*(1-EXP(-N112*G112/M112)))*(M112*(1-EXP(-N112*G112/M112))),0)","v":{"$error":"#N/A"}},null,{"$f":"IF(O112>0, (D112*E112)/O112,0)","v":{"$error":"#N/A"}},{"$f":"IF(M112>0, (M112*(1-EXP(-N112*K112/M112)))*(M112*(1-EXP(-N112*K112/M112))), 0)","v":{"$error":"#N/A"}},{"$f":"IF(M112>0,(M112*(1-EXP(-N112*K112/M112)))*L112,0)","v":{"$error":"#N/A"}},{"$error":"#N/A"},{"$error":"#N/A"},{"$f":"VLOOKUP($F112,VegTypeParameters!$A:$H,8,FALSE)","v":{"$error":"#N/A"}},".",".",".","."]
[2,27,0,0,null,null,null,{"$f":"VLOOKUP(F113,VegTypeParameters!A:G,2,FALSE)","v":{"$error":"#N/A"}},{"$f":"VLOOKUP($F113,VegTypeParameters!$A:$G,5,FALSE)","v":{"$error":"#N/A"}},{"$f":"VLOOKUP($F113,VegTypeParameters!$A:$G,4,FALSE)","v":{"$error":"#N/A"}},{"$f":"G113+FieldBeeForm!$E$11","v":12},{"$error":"#N/A"},{"$f":"(VLOOKUP($F113,VegTypeParameters!A:G,6,FALSE))","v":{"$error":"#N/A"}},{"$f":"(VLOOKUP($F113,VegTypeParameters!A:G,7,FALSE))","v":{"$error":"#N/A"}},{"$error":"#N/A"},null,{"$error":"#N/A"},{"$error":"#N/A"},{"$error":"#N/A"},{"$error":"#N/A"},{"$error":"#N/A"},{"$f":"VLOOKUP($F113,VegTypeParameters!$A:$H,8,FALSE)","v":{"$error":"#N/A"}},".",".",".","."]
[2,28,0,0,null,null,null,{"$f":"VLOOKUP(F114,VegTypeParameters!A:G,2,FALSE)","v":{"$error":"#N/A"}},{"$f":"VLOOKUP($F114,VegTypeParameters!$A:$G,5,FALSE)","v":{"$error":"#N/A"}},{"$f":"VLOOKUP($F114,VegTypeParameters!$A:$G,4,FALSE)","v":{"$error":"#N/A"}},{"$f":"G114+FieldBeeForm!$E$11","v":12},{"$error":"#N/A"},{"$f":"(VLOOKUP($F114,VegTypeParameters!A:G,6,FALSE))","v":{"$error":"#N/A"}},{"$f":"(VLOOKUP($F114,VegTypeParameters!A:G,7,FALSE))","v":{"$error":"#N/A"}},{"$error":"#N/A"},null,{"$error":"#N/A"},{"$error":"#N/A"},{"$error":"#N/A"},{"$error":"#N/A"},{"$error":"#N/A"},{"$f":"VLOOKUP($F114,VegTypeParameters!$A:$H,8,FALSE)","v":{"$error":"#N/A"}},".",".",".","."]
[2,29,0,0,null,null,null,{"$f":"VLOOKUP(F115,VegTypeParameters!A:G,2,FALSE)","v":{"$error":"#N/A"}},{"$f":"VLOOKUP($F115,VegTypeParameters!$A:$G,5,FALSE)","v":{"$error":"#N/A"}},{"$f":"VLOOKUP($F115,VegTypeParameters!$A:$G,4,FALSE)","v":{"$error":"#N/A"}},{"$f":"G115+FieldBeeForm!$E$11","v":12},{"$error":"#N/A"},{"$f":"(VLOOKUP($F115,VegTypeParameters!A:G,6,FALSE))","v":{"$error":"#N/A"}},{"$f":"(VLOOKUP($F115,VegTypeParameters!A:G,7,FALSE))","v":{"$error":"#N/A"}},{"$error":"#N/A"},null,{"$error":"#N/A"},{"$error":"#N/A"},{"$error":"#N/A"},{"$error":"#N/A"},{"$error":"#N/A"},{"$f":"VLOOKUP($F115,VegTypeParameters!$A:$H,8,FALSE)","v":{"$error":"#N/A"}},".",".",".","."]
[2,30,0,0,null,null,null,{"$f":"VLOOKUP(F116,VegTypeParameters!A:G,2,FALSE)","v":{"$error":"#N/A"}},{"$f":"VLOOKUP($F116,VegTypeParameters!$A:$G,5,FALSE)","v":{"$error":"#N/A"}},{"$f":"VLOOKUP($F116,VegTypeParameters!$A:$G,4,FALSE)","v":{"$error":"#N/A"}},{"$f":"G116+FieldBeeForm!$E$11","v":12},{"$error":"#N/A"},{"$f":"(VLOOKUP($F116,VegTypeParameters!A:G,6,FALSE))","v":{"$error":"#N/A"}},{"$f":"(VLOOKUP($F116,VegTypeParameters!A:G,7,FALSE))","v":{"$error":"#N/A"}},{"$error":"#N/A"},null,{"$error":"#N/A"},{"$error":"#N/A"},{"$error":"#N/A"},{"$error":"#N/A"},{"$error":"#N/A"},{"$f":"VLOOKUP($F116,VegTypeParameters!$A:$H,8,FALSE)","v":{"$error":"#N/A"}},".",".",".","."]
[2,31,0,0,null,null,null,{"$f":"VLOOKUP(F117,VegTypeParameters!A:G,2,FALSE)","v":{"$error":"#N/A"}},{"$f":"VLOOKUP($F117,VegTypeParameters!$A:$G,5,FALSE)","v":{"$error":"#N/A"}},{"$f":"VLOOKUP($F117,VegTypeParameters!$A:$G,4,FALSE)","v":{"$error":"#N/A"}},{"$f":"G117+FieldBeeForm!$E$11","v":12},{"$error":"#N/A"},{"$f":"(VLOOKUP($F117,VegTypeParameters!A:G,6,FALSE))","v":{"$error":"#N/A"}},{"$f":"(VLOOKUP($F117,VegTypeParameters!A:G,7,FALSE))","v":{"$error":"#N/A"}},{"$error":"#N/A"},null,{"$error":"#N/A"},{"$error":"#N/A"},{"$error":"#N/A"},{"$error":"#N/A"},{"$error":"#N/A"},{"$f":"VLOOKUP($F117,VegTypeParameters!$A:$H,8,FALSE)","v":{"$error":"#N/A"}},".",".",".","."]
[2,32,0,0,null,null,null,{"$f":"VLOOKUP(F118,VegTypeParameters!A:G,2,FALSE)","v":{"$error":"#N/A"}},{"$f":"VLOOKUP($F118,VegTypeParameters!$A:$G,5,FALSE)","v":{"$error":"#N/A"}},{"$f":"VLOOKUP($F118,VegTypeParameters!$A:$G,4,FALSE)","v":{"$error":"#N/A"}},{"$f":"G118+FieldBeeForm!$E$11","v":12},{"$error":"#N/A"},{"$f":"(VLOOKUP($F118,VegTypeParameters!A:G,6,FALSE))","v":{"$error":"#N/A"}},{"$f":"(VLOOKUP($F118,VegTypeParameters!A:G,7,FALSE))","v":{"$error":"#N/A"}},{"$error":"#N/A"},null,{"$error":"#N/A"},{"$error":"#N/A"},{"$error":"#N/A"},{"$error":"#N/A"},{"$error":"#N/A"},{"$f":"VLOOKUP($F118,VegTypeParameters!$A:$H,8,FALSE)","v":{"$error":"#N/A"}},".",".",".","."]
[2,33,0,0,null,null,null,{"$f":"VLOOKUP(F119,VegTypeParameters!A:G,2,FALSE)","v":{"$error":"#N/A"}},{"$f":"VLOOKUP($F119,VegTypeParameters!$A:$G,5,FALSE)","v":{"$error":"#N/A"}},{"$f":"VLOOKUP($F119,VegTypeParameters!$A:$G,4,FALSE)","v":{"$error":"#N/A"}},{"$f":"G119+FieldBeeForm!$E$11","v":12},{"$error":"#N/A"},{"$f":"(VLOOKUP($F119,VegTypeParameters!A:G,6,FALSE))","v":{"$error":"#N/A"}},{"$f":"(VLOOKUP($F119,VegTypeParameters!A:G,7,FALSE))","v":{"$error":"#N/A"}},{"$error":"#N/A"},null,{"$error":"#N/A"},{"$error":"#N/A"},{"$error":"#N/A"},{"$error":"#N/A"},{"$error":"#N/A"},{"$f":"VLOOKUP($F119,VegTypeParameters!$A:$H,8,FALSE)","v":{"$error":"#N/A"}},".",".",".","."]
[2,34,0,0,null,null,null,{"$f":"VLOOKUP(F120,VegTypeParameters!A:G,2,FALSE)","v":{"$error":"#N/A"}},{"$f":"VLOOKUP($F120,VegTypeParameters!$A:$G,5,FALSE)","v":{"$error":"#N/A"}},{"$f":"VLOOKUP($F120,VegTypeParameters!$A:$G,4,FALSE)","v":{"$error":"#N/A"}},{"$f":"G120+FieldBeeForm!$E$11","v":12},{"$error":"#N/A"},{"$f":"(VLOOKUP($F120,VegTypeParameters!A:G,6,FALSE))","v":{"$error":"#N/A"}},{"$f":"(VLOOKUP($F120,VegTypeParameters!A:G,7,FALSE))","v":{"$error":"#N/A"}},{"$error":"#N/A"},null,{"$error":"#N/A"},{"$error":"#N/A"},{"$error":"#N/A"},{"$error":"#N/A"},{"$error":"#N/A"},{"$f":"VLOOKUP($F120,VegTypeParameters!$A:$H,8,FALSE)","v":{"$error":"#N/A"}},".",".",".","."]
[2,35,0,0,null,null,null,{"$f":"VLOOKUP(F121,VegTypeParameters!A:G,2,FALSE)","v":{"$error":"#N/A"}},{"$f":"VLOOKUP($F121,VegTypeParameters!$A:$G,5,FALSE)","v":{"$error":"#N/A"}},{"$f":"VLOOKUP($F121,VegTypeParameters!$A:$G,4,FALSE)","v":{"$error":"#N/A"}},{"$f":"G121+FieldBeeForm!$E$11","v":12},{"$error":"#N/A"},{"$f":"(VLOOKUP($F121,VegTypeParameters!A:G,6,FALSE))","v":{"$error":"#N/A"}},{"$f":"(VLOOKUP($F121,VegTypeParameters!A:G,7,FALSE))","v":{"$error":"#N/A"}},{"$error":"#N/A"},null,{"$error":"#N/A"},{"$error":"#N/A"},{"$error":"#N/A"},{"$error":"#N/A"},{"$error":"#N/A"},{"$f":"VLOOKUP($F121,VegTypeParameters!$A:$H,8,FALSE)","v":{"$error":"#N/A"}},".",".",".","."]
[null,null,null,"Horizontal extent of pollinator plant cover (m2) per season",null,null,null,"Vertical extent of pollinator plant cover (m2) per season",null,null,null,"Number of different pollinator plant species per season"]
["Map Unit #","Vegetation Entry",null,"Spatial extent of Veg Type (m2)","Early","Mid","Late","Spatial extent of Veg Type (m2)","Early","Mid","Late","Early","Mid","Late"]
[{"$f":"A87","v":2},{"$f":"B87","v":1},null,{"$f":"+IF(ISNA(VLOOKUP(B124,B$87:D$121, 3, FALSE)),0,VLOOKUP(B124,B$87:D$121, 3, FALSE))","v":0},{"$f":"+IF(SUMIFS(T$87:T$121, B$87:B$121, $B124, V$87:V$121, \"*\"&\"Early\"&\"*\") <=$D124, SUMIFS(T$87:T$121, B$87:B$121, $B124, V$87:V$121, \"*\"&\"Early\"&\"*\"), $D124)","v":0},{"$f":"+IF(SUMIFS(T$87:T$121,B$87:B$121, $B124, V$87:V$121, \"*\"&\"Mid\"&\"*\") <=$D124, SUMIFS(T$87:T$121, B$87:B$121, $B124, V$87:V$121, \"*\"&\"Mid\"&\"*\"), $D124)","v":0},{"$f":"+IF(SUMIFS(T$87:T$121, B$87:B$121, $B124, $V$87:$V$121, \"*\"&\"Late\"&\"*\") <=$D124, SUMIFS(T$87:T$121,B$87:B$121, $B124, $V$87:$V$121, \"*\"&\"Late\"&\"*\"), $D124)","v":0},{"$f":"+IF(ISNA(VLOOKUP(B124,B$87:D$121, 3, FALSE)),0,VLOOKUP(B124,B$87:D$121, 3, FALSE))","v":0},{"$f":"+IF(SUMIFS($U87:$U$121,B$87:B$121, $B124, $V$87:$V$121, \"*\"&\"Early\"&\"*\") <=$D124, SUMIFS($U$87:$U$121, B$87:B$121, $B124, $V$87:$V$121, \"*\"&\"Early\"&\"*\"), $D124)","v":0},{"$f":"+IF(SUMIFS($U$87:$U$121, $B$87:$B$121, $B124, $V$87:$V$121, \"*\"&\"Mid\"&\"*\") <=$D124, SUMIFS($U$87:$U$121, $B$87:$B$121, $B124, $V$87:$V$121, \"*\"&\"Mid\"&\"*\"), $D124)","v":0},{"$f":"+IF(SUMIFS($U$87:$U$121, $B$87:$B$121, $B124, $V$87:$V$121, \"*\"&\"Late\"&\"*\") <=$D124, SUMIFS($U$87:$U$121, $B$87:$B$121, $B124, $V$87:$V$121, \"*\"&\"Late\"&\"*\"), $D124)","v":0}," "]
[{"$f":"A88","v":2},{"$f":"B88","v":2},null,{"$f":"+IF(ISNA(VLOOKUP(B125,B$87:D$121, 3, FALSE)),0,VLOOKUP(B125,B$87:D$121, 3, FALSE))","v":0},{"$f":"+IF(SUMIFS(T$87:T$121, B$87:B$121, $B125, V$87:V$121, \"*\"&\"Early\"&\"*\") <=$D125, SUMIFS(T$87:T$121, B$87:B$121, $B125, V$87:V$121, \"*\"&\"Early\"&\"*\"), $D125)","v":0},{"$f":"+IF(SUMIFS(T$87:T$121,B$87:B$121, $B125, V$87:V$121, \"*\"&\"Mid\"&\"*\") <=$D125, SUMIFS(T$87:T$121, B$87:B$121, $B125, V$87:V$121, \"*\"&\"Mid\"&\"*\"), $D125)","v":0},{"$f":"+IF(SUMIFS(T$87:T$121, B$87:B$121, $B125, $V$87:$V$121, \"*\"&\"Late\"&\"*\") <=$D125, SUMIFS(T$87:T$121,B$87:B$121, $B125, $V$87:$V$121, \"*\"&\"Late\"&\"*\"), $D125)","v":0},{"$f":"+IF(ISNA(VLOOKUP(B125,B$87:D$121, 3, FALSE)),0,VLOOKUP(B125,B$87:D$121, 3, FALSE))","v":0},{"$f":"+IF(SUMIFS($U$87:$U$121,B$87:B$121, $B125, $V$87:$V$121, \"*\"&\"Early\"&\"*\") <=$D125, SUMIFS($U$87:$U$121, B$87:B$121, $B125, $V$87:$V$121, \"*\"&\"Early\"&\"*\"), $D125)","v":0},{"$f":"+IF(SUMIFS($U$87:$U$121, $B$87:$B$121, $B125, $V$87:$V$121, \"*\"&\"Mid\"&\"*\") <=$D125, SUMIFS($U$87:$U$121, $B$87:$B$121, $B125, $V$87:$V$121, \"*\"&\"Mid\"&\"*\"), $D125)","v":0},{"$f":"+IF(SUMIFS($U$87:$U$121, $B$87:$B$121, $B125, $V$87:$V$121, \"*\"&\"Late\"&\"*\") <=$D125, SUMIFS($U$87:$U$121, $B$87:$B$121, $B125, $V$87:$V$121, \"*\"&\"Late\"&\"*\"), $D125)","v":0}," "]
[{"$f":"A89","v":2},3,null,0,0,0,0,0,{"$f":"+IF(SUMIFS($U$87:$U$121,B$87:B$121, $B126, $V$87:$V$121, \"*\"&\"Early\"&\"*\") <=$D126, SUMIFS($U$87:$U$121, B$87:B$121, $B126, $V$87:$V$121, \"*\"&\"Early\"&\"*\"), $D126)","v":0},0,0]
[{"$f":"A90","v":2},4,null,0,0,0,0,0,0,0,0]
[{"$f":"A91","v":2},5,null,0,0,0,0,0,0,0,0]
[{"$f":"A92","v":2},6,null,0,0,0,{"$f":"+IF(SUMIFS(T$87:T$121, B$87:B$121, $B129, $V$87:$V$121, \"*\"&\"Late\"&\"*\") <=$D129, SUMIFS(T$87:T$121,B$87:B$121, $B129, $V$87:$V$121, \"*\"&\"Late\"&\"*\"), $D129)","v":0},0,0,0,0]
[{"$f":"A93","v":2},7,null,0,0,0,0,0,0,0,0]
[{"$f":"A94","v":2},8,null,0,0,0,0,0,0,0,0]
[{"$f":"A95","v":2},9,null,0,0,{"$f":"+IF(SUMIFS(T$87:T$121,B$87:B$121, $B132, V$87:V$121, \"*\"&\"Mid\"&\"*\") <=$D132, SUMIFS(T$87:T$121, B$87:B$121, $B132, V$87:V$121, \"*\"&\"Mid\"&\"*\"), $D132)","v":0},0,0,0,0,0]
[{"$f":"A96","v":2},10,null,0,0,0,0,0,0,0,0]
[{"$f":"A97","v":2},11,null,{"$f":"+IF(ISNA(VLOOKUP(B134,B$87:D$121, 3, FALSE)),0,VLOOKUP(B134,B$87:D$121, 3, FALSE))","v":0},{"$f":"+IF(SUMIFS(T$87:T$121, B$87:B$121, $B134, V$87:V$121, \"*\"&\"Early\"&\"*\") <=$D134, SUMIFS(T$87:T$121, B$87:B$121, $B134, V$87:V$121, \"*\"&\"Early\"&\"*\"), $D134)","v":0},{"$f":"+IF(SUMIFS(T$87:T$121,B$87:B$121, $B134, V$87:V$121, \"*\"&\"Mid\"&\"*\") <=$D134, SUMIFS(T$87:T$121, B$87:B$121, $B134, V$87:V$121, \"*\"&\"Mid\"&\"*\"), $D134)","v":0},{"$f":"+IF(SUMIFS(T$87:T$121, B$87:B$121, $B134, $V$87:$V$121, \"*\"&\"Late\"&\"*\") <=$D134, SUMIFS(T$87:T$121,B$87:B$121, $B134, $V$87:$V$121, \"*\"&\"Late\"&\"*\"), $D134)","v":0},{"$f":"+IF(ISNA(VLOOKUP(B134,B$87:D$121, 3, FALSE)),0,VLOOKUP(B134,B$87:D$121, 3, FALSE))","v":0},{"$f":"+IF(SUMIFS($U$87:$U$121,B$87:B$121, $B134, $V$87:$V$121, \"*\"&\"Early\"&\"*\") <=$D134, SUMIFS($U$87:$U$121, B$87:B$121, $B134, $V$87:$V$121, \"*\"&\"Early\"&\"*\"), $D134)","v":0},0,0]
[{"$f":"A98","v":2},12,null,0,0,0,0,0,0,0,0]
[{"$f":"A99","v":2},13,null,0,0,0,0,0,0,0,0]
[{"$f":"A100","v":2},14,null,0,0,0,0,0,0,0,0]
[{"$f":"A101","v":2},15,null,0,0,0,0,0,0,0,0]
[{"$f":"A102","v":2},16,null,0,0,0,0,0,0,0,0]
[{"$f":"A103","v":2},17,null,0,0,0,0,0,0,0,0]
[{"$f":"A104","v":2},18,null,0,0,0,0,0,0,0,0]
[{"$f":"A105","v":2},19,null,0,0,0,0,0,0,0,0]
[{"$f":"A106","v":2},20,null,0,0,0,0,0,0,0,0]
[{"$f":"A107","v":2},21,null,0,0,0,0,0,0,0,0]
[{"$f":"A108","v":2},22,null,0,0,0,0,0,0,0,0]
[{"$f":"A109","v":2},23,null,0,0,0,0,0,0,0,0]
[{"$f":"A110","v":2},24,null,0,0,0,0,0,0,0,0]
[{"$f":"A111","v":2},25,null,0,0,0,0,0,0,0,0]
[{"$f":"A112","v":2},26,null,0,0,0,0,0,0,0,0]
[{"$f":"A113","v":2},27,null,0,0,0,0,0,0,0,0]
[{"$f":"A114","v":2},28,null,0,0,0,0,0,0,0,0]
[{"$f":"A115","v":2},29,null,0,0,0,0,0,0,0,0]
[{"$f":"A116","v":2},30,null,0,0,0,0,0,0,0,0]
[{"$f":"A117","v":2},31,null,0,0,0,0,0,0,0,0]
[{"$f":"A118","v":2},32,null,0,0,0,0,0,0,0,0]
[{"$f":"A119","v":2},33,null,0,0,0,0,0,0,0,0]
[{"$f":"A120","v":2},34,null,0,0,0,0,0,0,0,0]
[{"$f":"A121","v":2},35,null,0,0,0,0,0,0,0,0]
[{"$f":"A87","v":2},"Total",null,{"$f":"+SUM(D124:D158)","v":0},{"$f":"+SUM(E124:E158)","v":0},0,0,0,0,0,0,{"$f":"+X86","v":7},{"$f":"+Y86","v":10},{"$f":"+Z86","v":7}]
[null," ",null,{"$f":"D159","v":0},"Map Unit Size in Acres",null,{"$f":"FieldBeeForm!F14","v":50000},"Value entered in FieldBeeForm (Should be same as cell C110)"]
[]
["Enter only in yellow cells. Leave rest untouched.",null,null,null,null,null,"Enter the current year age in column G for each vegetation type. This age will be added to the assessment year (input on Field data form) to determine time series age in column K. If you are interested in just the current effects, enter a '0' in cell E11 of the Field data form."]
["Map Unit","Vegetation Entry","Map Unit Size","Spatial extent of Veg Type","Existing Cover Class for VegType","Species/ VegType","Existing Age of Average Plant \n(for S enter 1, for Sa enter 2, for P enter 3, for M enter 5, for D enter 10)","Species/Vegetation Type Descriptions","Ht Rate","Ht max","Future Age","Future Height","Canopy Width Max (m)","Canopy Width Rate","Existing Age canopy area per plant",null,"Estimated # Individuals","Future Horizontal Surface Area per plant (width x width)","Future Vertical Surface Area per plant (width x height)","Horizontal Surface Area Across Map Unit","Vertical Surface Area Across Map Unit","Season(s)","Season(s) (.)","Early","Mid","Late"]
["#","#"," sq ft","m2","%","code","yrs",null,"m/yr","m","yrs","m","m","m/yr","m2",null,"number","m2","m2","m2","m2",null,null,{"$f":"SUM(IF(FREQUENCY(MATCH(X165:X199, X165:X199,0),MATCH(X165:X199, X165:X199,0))>0,1))-1","v":7},{"$f":"SUM(IF(FREQUENCY(MATCH(Y165:Y199, Y165:Y199,0),MATCH(Y165:Y199, Y165:Y199,0))>0,1))-1","v":10},{"$f":"SUM(IF(FREQUENCY(MATCH(Z165:Z199, Z165:Z199,0),MATCH(Z165:Z199, Z165:Z199,0))>0,1))-1","v":7}]
[3,1,null,{"$f":"(0.092903*C165)*E165","v":0},0.06,1600,5,{"$f":"VLOOKUP(F165,VegTypeParameters!A:G,2,FALSE)","v":"Atriplex"},{"$f":"VLOOKUP($F165,VegTypeParameters!$A:$G,5,FALSE)","v":3.2962962962962963},{"$f":"VLOOKUP($F165,VegTypeParameters!$A:$G,4,FALSE)","v":3},{"$f":"G165+FieldBeeForm!$E$11","v":17},{"$f":"IF(J165>0,J165*(1-EXP(-I165*K165/J165)), 0)","v":2.9999999768298276},{"$f":"(VLOOKUP($F165,VegTypeParameters!A:G,6,FALSE))","v":5},{"$f":"(VLOOKUP($F165,VegTypeParameters!A:G,7,FALSE))","v":7.1111111111111107},{"$f":"IF(M165>0, (M165*(1-EXP(-N165*G165/M165)))*(M165*(1-EXP(-N165*G165/M165))),0)","v":24.959217254150069},null,{"$f":"IF(O165>0, (D165*E165)/O165,0)","v":0},{"$f":"IF(M165>0, (M165*(1-EXP(-N165*K165/M165)))*(M165*(1-EXP(-N165*K165/M165))), 0)","v":24.99999999841986},{"$f":"IF(M165>0,(M165*(1-EXP(-N165*K165/M165)))*L165,0)","v":14.999999883675097},{"$f":"R165*Q165","v":0},{"$f":"S165*Q165","v":0},{"$f":"VLOOKUP($F165,VegTypeParameters!$A:$H,8,FALSE)","v":"Mid/Late"},{"$f":"+IF(ISNA(V165), \".\",  V165)","v":"Mid/Late"},{"$f":"IF($W165=\"Early/Mid\",$H165,IF($W165=\"Early\", $H165, IF($W165=\"Early/Mid/Late\", $H165,\".\")))","v":"."},{"$f":"IF($W165=\"Early/Mid\",$H165,IF($W165=\"Mid\", $H165, IF($W165=\"Mid/Late\", $H165, IF($W165=\"Early/Mid/Late\", $H165,\".\"))))","v":"Atriplex"},{"$f":"IF($W165=\"Mid/Late\",$H165,IF($W165=\"Late\", $H165, IF($W165=\"Early/Mid/Late\", $H165,\".\")))","v":"Atriplex"}]
[3,2,{"$f":"C$165","v":0},{"$f":"(0.092903*C166)*E166","v":0},0.03,4200,3,{"$f":"VLOOKUP(F166,VegTypeParameters!A:G,2,FALSE)","v":"Helianthus"},{"$f":"VLOOKUP($F166,VegTypeParameters!$A:$G,5,FALSE)","v":6.5},{"$f":"VLOOKUP($F166,VegTypeParameters!$A:$G,4,FALSE)","v":2.5},{"$f":"G166+FieldBeeForm!$E$11","v":15},2.5,{"$f":"(VLOOKUP($F166,VegTypeParameters!A:G,6,FALSE))","v":0.75},{"$f":"(VLOOKUP($F166,VegTypeParameters!A:G,7,FALSE))","v":1.25},0.55494534708652032,null,0,0.56249999998437616,1.8749999999739604,0,0,{"$f":"VLOOKUP($F166,VegTypeParameters!$A:$H,8,FALSE)","v":"Mid/Late"},{"$f":"+IF(ISNA(V166), \".\",  V166)","v":"Mid/Late"},{"$f":"IF($W166=\"Early/Mid\",$H166,IF($W166=\"Early\", $H166, IF($W166=\"Early/Mid/Late\", $H166,\".\")))","v":"."},{"$f":"IF($W166=\"Early/Mid\",$H166,IF($W166=\"Mid\", $H166, IF($W166=\"Mid/Late\", $H166, IF($W166=\"Early/Mid/Late\", $H166,\".\"))))","v":"Helianthus"},{"$f":"IF($W166=\"Mid/Late\",$H166,IF($W166=\"Late\", $H166, IF($W166=\"Early/Mid/Late\", $H166,\".\")))","v":"Helianthus"}]
[3,3,{"$f":"C$165","v":0},0,0.08,4000,3,{"$f":"VLOOKUP(F167,VegTypeParameters!A:G,2,FALSE)","v":"Grindelia"},{"$f":"VLOOKUP($F167,VegTypeParameters!$A:$G,5,FALSE)","v":1.6666666666666667},{"$f":"VLOOKUP($F167,VegTypeParameters!$A:$G,4,FALSE)","v":2.5},{"$f":"G167+FieldBeeForm!$E$11","v":15},2.4998865001755939,{"$f":"(VLOOKUP($F167,VegTypeParameters!A:G,6,FALSE))","v":2},{"$f":"(VLOOKUP($F167,VegTypeParameters!A:G,7,FALSE))","v":1.3333333333333333},2.9905802896620353,null,0,3.9996368088065144,4.9995460110081433,0,0,{"$f":"VLOOKUP($F167,VegTypeParameters!$A:$H,8,FALSE)","v":"Mid/Late"},"Mid/Late",".","Grindelia","Grindelia"]
[3,4,0,0,0.08,7000,3,{"$f":"VLOOKUP(F168,VegTypeParameters!A:G,2,FALSE)","v":"Salix (shrub)"},{"$f":"VLOOKUP($F168,VegTypeParameters!$A:$G,5,FALSE)","v":0.73},{"$f":"VLOOKUP($F168,VegTypeParameters!$A:$G,4,FALSE)","v":3.5},{"$f":"G168+FieldBeeForm!$E$11","v":15},3.3467689644197414,{"$f":"(VLOOKUP($F168,VegTypeParameters!A:G,6,FALSE))","v":2.5},{"$f":"(VLOOKUP($F168,VegTypeParameters!A:G,7,FALSE))","v":0.55000000000000004},1.4589539561403246,null,0,5.7974627077191743,8.0583238111294335,0,0,{"$f":"VLOOKUP($F168,VegTypeParameters!$A:$H,8,FALSE)","v":"Early"},"Early","Salix (shrub)",".","."]
[3,5,0,0,0.08,8400,5,{"$f":"VLOOKUP(F169,VegTypeParameters!A:G,2,FALSE)","v":"Weeds, non-invasive and not beneficial to pollinators"},{"$f":"VLOOKUP($F169,VegTypeParameters!$A:$G,5,FALSE)","v":0},{"$f":"VLOOKUP($F169,VegTypeParameters!$A:$G,4,FALSE)","v":0},{"$f":"G169+FieldBeeForm!$E$11","v":17},0,{"$f":"(VLOOKUP($F169,VegTypeParameters!A:G,6,FALSE))","v":0},{"$f":"(VLOOKUP($F169,VegTypeParameters!A:G,7,FALSE))","v":0},0,null,0,0,0,0,0,{"$f":"VLOOKUP($F169,VegTypeParameters!$A:$H,8,FALSE)","v":"Never"},"Never",".",".","."]
[3,6,0,0,0.08,5300,3,{"$f":"VLOOKUP(F170,VegTypeParameters!A:G,2,FALSE)","v":"Medicago "},{"$f":"VLOOKUP($F170,VegTypeParameters!$A:$G,5,FALSE)","v":0.5},{"$f":"VLOOKUP($F170,VegTypeParameters!$A:$G,4,FALSE)","v":0.5},{"$f":"G170+FieldBeeForm!$E$11","v":15},0.49999984704883976,{"$f":"(VLOOKUP($F170,VegTypeParameters!A:G,6,FALSE))","v":0.7},{"$f":"(VLOOKUP($F170,VegTypeParameters!A:G,7,FALSE))","v":0.7},0.44242326156605982,null,0,0.48999970021577172,0.34999978586840841,0,0,{"$f":"VLOOKUP($F170,VegTypeParameters!$A:$H,8,FALSE)","v":"Mid/Late"},"Mid/Late",".","Medicago ","Medicago "]
[3,7,0,0,0.08,1600,3,{"$f":"VLOOKUP(F171,VegTypeParameters!A:G,2,FALSE)","v":"Atriplex"},{"$f":"VLOOKUP($F171,VegTypeParameters!$A:$G,5,FALSE)","v":3.2962962962962963},{"$f":"VLOOKUP($F171,VegTypeParameters!$A:$G,4,FALSE)","v":3},{"$f":"G171+FieldBeeForm!$E$11","v":15},2.999999791404568,{"$f":"(VLOOKUP($F171,VegTypeParameters!A:G,6,FALSE))","v":5},{"$f":"(VLOOKUP($F171,VegTypeParameters!A:G,7,FALSE))","v":7.1111111111111107},24.303496604054391,null,0,24.999999972834292,14.999998948873127,0,0,{"$f":"VLOOKUP($F171,VegTypeParameters!$A:$H,8,FALSE)","v":"Mid/Late"},"Mid/Late",".","Atriplex","Atriplex"]
[3,8,0,0,0.03,7500,3,{"$f":"VLOOKUP(F172,VegTypeParameters!A:G,2,FALSE)","v":"Scrophularia"},{"$f":"VLOOKUP($F172,VegTypeParameters!$A:$G,5,FALSE)","v":1.2},{"$f":"VLOOKUP($F172,VegTypeParameters!$A:$G,4,FALSE)","v":1.2},{"$f":"G172+FieldBeeForm!$E$11","v":15},1.1999996329172153,{"$f":"(VLOOKUP($F172,VegTypeParameters!A:G,6,FALSE))","v":0.3},{"$f":"(VLOOKUP($F172,VegTypeParameters!A:G,7,FALSE))","v":0.3},8.1261415389684455E-2,null,0,8.9999944937590726E-2,0.3599997797503629,0,0,{"$f":"VLOOKUP($F172,VegTypeParameters!$A:$H,8,FALSE)","v":"Early/Mid"},"Early/Mid","Scrophularia","Scrophularia","."]
[3,9,0,0,0.03,3500,3,{"$f":"VLOOKUP(F173,VegTypeParameters!A:G,2,FALSE)","v":"Ficus carica"},{"$f":"VLOOKUP($F173,VegTypeParameters!$A:$G,5,FALSE)","v":0},{"$f":"VLOOKUP($F173,VegTypeParameters!$A:$G,4,FALSE)","v":0},{"$f":"G173+FieldBeeForm!$E$11","v":15},0,{"$f":"(VLOOKUP($F173,VegTypeParameters!A:G,6,FALSE))","v":0},{"$f":"(VLOOKUP($F173,VegTypeParameters!A:G,7,FALSE))","v":0},0,null,0,0,0,0,0,{"$f":"VLOOKUP($F173,VegTypeParameters!$A:$H,8,FALSE)","v":"Never"},"Never",".",".","."]
[3,10,0,0,0.03,6200,3,{"$f":"VLOOKUP(F174,VegTypeParameters!A:G,2,FALSE)","v":"Other late blooming native plants beneficial to pollinators"},{"$f":"VLOOKUP($F174,VegTypeParameters!$A:$G,5,FALSE)","v":0.25},{"$f":"VLOOKUP($F174,VegTypeParameters!$A:$G,4,FALSE)","v":1},{"$f":"G174+FieldBeeForm!$E$11","v":15},0.97648225414399092,{"$f":"(VLOOKUP($F174,VegTypeParameters!A:G,6,FALSE))","v":0.5},{"$f":"(VLOOKUP($F174,VegTypeParameters!A:G,7,FALSE))","v":0.25},0.15088168701775109,null,0,0.24972353429050623,0.48797108853574861,0,0,{"$f":"VLOOKUP($F174,VegTypeParameters!$A:$H,8,FALSE)","v":"Late"},"Late",".",".","Other late blooming native plants beneficial to pollinators"]
[3,11,0,0,0.03,2500,3,{"$f":"VLOOKUP(F175,VegTypeParameters!A:G,2,FALSE)","v":"Clarkia"},{"$f":"VLOOKUP($F175,VegTypeParameters!$A:$G,5,FALSE)","v":0.4},{"$f":"VLOOKUP($F175,VegTypeParameters!$A:$G,4,FALSE)","v":0.4},{"$f":"G175+FieldBeeForm!$E$11","v":15},0.39999987763907185,{"$f":"(VLOOKUP($F175,VegTypeParameters!A:G,6,FALSE))","v":0.1},{"$f":"(VLOOKUP($F175,VegTypeParameters!A:G,7,FALSE))","v":0.1},9.029046154409387E-3,null,0,9.9999938819545289E-3,3.9999975527818116E-2,0,0,{"$f":"VLOOKUP($F175,VegTypeParameters!$A:$H,8,FALSE)","v":"Early/Mid"},"Early/Mid","Clarkia","Clarkia","."]
[3,12,0,0,0.08,5000,3,{"$f":"VLOOKUP(F176,VegTypeParameters!A:G,2,FALSE)","v":"Lupinus spp."},{"$f":"VLOOKUP($F176,VegTypeParameters!$A:$G,5,FALSE)","v":0.98000000000000009},{"$f":"VLOOKUP($F176,VegTypeParameters!$A:$G,4,FALSE)","v":3},{"$f":"G176+FieldBeeForm!$E$11","v":15},2.9776602507872267,{"$f":"(VLOOKUP($F176,VegTypeParameters!A:G,6,FALSE))","v":3},{"$f":"(VLOOKUP($F176,VegTypeParameters!A:G,7,FALSE))","v":1.08},3.925206627733659,null,0,8.9188851385636738,8.8926342217348378,0,0,{"$f":"VLOOKUP($F176,VegTypeParameters!$A:$H,8,FALSE)","v":"Early/Mid/Late"},"Early/Mid/Late","Lupinus spp.","Lupinus spp.","Lupinus spp."]
[3,13,0,0,0.08,6000,3,{"$f":"VLOOKUP(F177,VegTypeParameters!A:G,2,FALSE)","v":"Orchard"},{"$f":"VLOOKUP($F177,VegTypeParameters!$A:$G,5,FALSE)","v":0.5},{"$f":"VLOOKUP($F177,VegTypeParameters!$A:$G,4,FALSE)","v":10},{"$f":"G177+FieldBeeForm!$E$11","v":15},5.2763344725898529,{"$f":"(VLOOKUP($F177,VegTypeParameters!A:G,6,FALSE))","v":6},{"$f":"(VLOOKUP($F177,VegTypeParameters!A:G,7,FALSE))","v":0.5},1.7614473685136525,null,0,18.326714576526665,22.58783601812447,0,0,{"$f":"VLOOKUP($F177,VegTypeParameters!$A:$H,8,FALSE)","v":"Early"},"Early","Orchard",".","."]
[3,14,0,0,0.03,3300,5,{"$f":"VLOOKUP(F178,VegTypeParameters!A:G,2,FALSE)","v":"Eschscholzia"},{"$f":"VLOOKUP($F178,VegTypeParameters!$A:$G,5,FALSE)","v":0.6},{"$f":"VLOOKUP($F178,VegTypeParameters!$A:$G,4,FALSE)","v":0.3},{"$f":"G178+FieldBeeForm!$E$11","v":17},0.29999999999999949,{"$f":"(VLOOKUP($F178,VegTypeParameters!A:G,6,FALSE))","v":0.15},{"$f":"(VLOOKUP($F178,VegTypeParameters!A:G,7,FALSE))","v":0.3},2.2497957049536645E-2,null,0,2.2499999999999923E-2,4.4999999999999846E-2,0,0,{"$f":"VLOOKUP($F178,VegTypeParameters!$A:$H,8,FALSE)","v":"Early/Mid"},"Early/Mid","Eschscholzia","Eschscholzia","."]
[3,15,0,0,0.03,5600,3,{"$f":"VLOOKUP(F179,VegTypeParameters!A:G,2,FALSE)","v":"Native forbs and graminoids not beneficial to pollinators"},{"$f":"VLOOKUP($F179,VegTypeParameters!$A:$G,5,FALSE)","v":0},{"$f":"VLOOKUP($F179,VegTypeParameters!$A:$G,4,FALSE)","v":0},{"$f":"G179+FieldBeeForm!$E$11","v":15},{"$f":"IF(J179>0,J179*(1-EXP(-I179*K179/J179)), 0)","v":0},{"$f":"(VLOOKUP($F179,VegTypeParameters!A:G,6,FALSE))","v":0},{"$f":"(VLOOKUP($F179,VegTypeParameters!A:G,7,FALSE))","v":0},{"$f":"IF(M179>0, (M179*(1-EXP(-N179*G179/M179)))*(M179*(1-EXP(-N179*G179/M179))),0)","v":0},null,{"$f":"IF(O179>0, (D179*E179)/O179,0)","v":0},{"$f":"IF(M179>0, (M179*(1-EXP(-N179*K179/M179)))*(M179*(1-EXP(-N179*K179/M179))), 0)","v":0},{"$f":"IF(M179>0,(M179*(1-EXP(-N179*K179/M179)))*L179,0)","v":0},0,0,{"$f":"VLOOKUP($F179,VegTypeParameters!$A:$H,8,FALSE)","v":"Never"},"Never",".",".","."]
[3,16,0,0,0.08,3800,3,{"$f":"VLOOKUP(F180,VegTypeParameters!A:G,2,FALSE)","v":"Gilia"},{"$f":"VLOOKUP($F180,VegTypeParameters!$A:$G,5,FALSE)","v":0.6},{"$f":"VLOOKUP($F180,VegTypeParameters!$A:$G,4,FALSE)","v":0.3},{"$f":"G180+FieldBeeForm!$E$11","v":15},{"$f":"IF(J180>0,J180*(1-EXP(-I180*K180/J180)), 0)","v":0.2999999999999719},{"$f":"(VLOOKUP($F180,VegTypeParameters!A:G,6,FALSE))","v":0.15},{"$f":"(VLOOKUP($F180,VegTypeParameters!A:G,7,FALSE))","v":0.3},{"$f":"IF(M180>0, (M180*(1-EXP(-N180*G180/M180)))*(M180*(1-EXP(-N180*G180/M180))),0)","v":2.2388594396827964E-2},null,{"$f":"IF(O180>0, (D180*E180)/O180,0)","v":0},{"$f":"IF(M180>0, (M180*(1-EXP(-N180*K180/M180)))*(M180*(1-EXP(-N180*K180/M180))), 0)","v":2.2499999999995784E-2},{"$f":"IF(M180>0,(M180*(1-EXP(-N180*K180/M180)))*L180,0)","v":4.4999999999991568E-2},0,0,{"$f":"VLOOKUP($F180,VegTypeParameters!$A:$H,8,FALSE)","v":"Mid"},"Mid",".","Gilia","."]
[3,17,0,0,0.08,1500,3,{"$f":"VLOOKUP(F181,VegTypeParameters!A:G,2,FALSE)","v":"Asclepias"},{"$f":"VLOOKUP($F181,VegTypeParameters!$A:$G,5,FALSE)","v":0.8},{"$f":"VLOOKUP($F181,VegTypeParameters!$A:$G,4,FALSE)","v":0.8},{"$f":"G181+FieldBeeForm!$E$11","v":15},0.79999975527814371,{"$f":"(VLOOKUP($F181,VegTypeParameters!A:G,6,FALSE))","v":0.2},{"$f":"(VLOOKUP($F181,VegTypeParameters!A:G,7,FALSE))","v":0.2},3.6116184617637548E-2,null,0,3.9999975527818116E-2,0.15999990211127246,0,0,{"$f":"VLOOKUP($F181,VegTypeParameters!$A:$H,8,FALSE)","v":"Early/Mid/Late"},"Early/Mid/Late","Asclepias","Asclepias","Asclepias"]
[3,18,0,0,5.0000000000000001E-3,1600,1,{"$f":"VLOOKUP(F182,VegTypeParameters!A:G,2,FALSE)","v":"Atriplex"},{"$f":"VLOOKUP($F182,VegTypeParameters!$A:$G,5,FALSE)","v":3.2962962962962963},{"$f":"VLOOKUP($F182,VegTypeParameters!$A:$G,4,FALSE)","v":3},{"$f":"G182+FieldBeeForm!$E$11","v":13},2.9999981220660135,{"$f":"(VLOOKUP($F182,VegTypeParameters!A:G,6,FALSE))","v":5},{"$f":"(VLOOKUP($F182,VegTypeParameters!A:G,7,FALSE))","v":7.1111111111111107},14.395290762184326,null,0,24.999999532966985,14.999990470220251,0,0,{"$f":"VLOOKUP($F182,VegTypeParameters!$A:$H,8,FALSE)","v":"Mid/Late"},"Mid/Late",".","Atriplex","Atriplex"]
[3,19,0,0,null,null,null,{"$f":"VLOOKUP(F183,VegTypeParameters!A:G,2,FALSE)","v":{"$error":"#N/A"}},{"$f":"VLOOKUP($F183,VegTypeParameters!$A:$G,5,FALSE)","v":{"$error":"#N/A"}},{"$f":"VLOOKUP($F183,VegTypeParameters!$A:$G,4,FALSE)","v":{"$error":"#N/A"}},{"$f":"G183+FieldBeeForm!$E$11","v":12},{"$error":"#N/A"},{"$f":"(VLOOKUP($F183,VegTypeParameters!A:G,6,FALSE))","v":{"$error":"#N/A"}},{"$f":"(VLOOKUP($F183,VegTypeParameters!A:G,7,FALSE))","v":{"$error":"#N/A"}},{"$error":"#N/A"},null,{"$error":"#N/A"},{"$error":"#N/A"},{"$error":"#N/A"},{"$error":"#N/A"},{"$error":"#N/A"},{"$f":"VLOOKUP($F183,VegTypeParameters!$A:$H,8,FALSE)","v":{"$error":"#N/A"}},".",".",".","."]
[3,20,0,0,null,null,null,{"$f":"VLOOKUP(F184,VegTypeParameters!A:G,2,FALSE)","v":{"$error":"#N/A"}},{"$f":"VLOOKUP($F184,VegTypeParameters!$A:$G,5,FALSE)","v":{"$error":"#N/A"}},{"$f":"VLOOKUP($F184,VegTypeParameters!$A:$G,4,FALSE)","v":{"$error":"#N/A"}},{"$f":"G184+FieldBeeForm!$E$11","v":12},{"$error":"#N/A"},{"$f":"(VLOOKUP($F184,VegTypeParameters!A:G,6,FALSE))","v":{"$error":"#N/A"}},{"$f":"(VLOOKUP($F184,VegTypeParameters!A:G,7,FALSE))","v":{"$error":"#N/A"}},{"$error":"#N/A"},null,{"$error":"#N/A"},{"$error":"#N/A"},{"$error":"#N/A"},{"$error":"#N/A"},{"$error":"#N/A"},{"$f":"VLOOKUP($F184,VegTypeParameters!$A:$H,8,FALSE)","v":{"$error":"#N/A"}},".",".",".","."]
[3,21,0,0,null,null,null,{"$f":"VLOOKUP(F185,VegTypeParameters!A:G,2,FALSE)","v":{"$error":"#N/A"}},{"$f":"VLOOKUP($F185,VegTypeParameters!$A:$G,5,FALSE)","v":{"$error":"#N/A"}},{"$f":"VLOOKUP($F185,VegTypeParameters!$A:$G,4,FALSE)","v":{"$error":"#N/A"}},{"$f":"G185+FieldBeeForm!$E$11","v":12},{"$error":"#N/A"},{"$f":"(VLOOKUP($F185,VegTypeParameters!A:G,6,FALSE))","v":{"$error":"#N/A"}},{"$f":"(VLOOKUP($F185,VegTypeParameters!A:G,7,FALSE))","v":{"$error":"#N/A"}},{"$error":"#N/A"},null,{"$error":"#N/A"},{"$error":"#N/A"},{"$error":"#N/A"},{"$error":"#N/A"},{"$error":"#N/A"},{"$f":"VLOOKUP($F185,VegTypeParameters!$A:$H,8,FALSE)","v":{"$error":"#N/A"}},".",".",".","."]
[3,22,0,0,null,null,null,{"$f":"VLOOKUP(F186,VegTypeParameters!A:G,2,FALSE)","v":{"$error":"#N/A"}},{"$f":"VLOOKUP($F186,VegTypeParameters!$A:$G,5,FALSE)","v":{"$error":"#N/A"}},{"$f":"VLOOKUP($F186,VegTypeParameters!$A:$G,4,FALSE)","v":{"$error":"#N/A"}},{"$f":"G186+FieldBeeForm!$E$11","v":12},{"$error":"#N/A"},{"$f":"(VLOOKUP($F186,VegTypeParameters!A:G,6,FALSE))","v":{"$error":"#N/A"}},{"$f":"(VLOOKUP($F186,VegTypeParameters!A:G,7,FALSE))","v":{"$error":"#N/A"}},{"$error":"#N/A"},null,{"$error":"#N/A"},{"$error":"#N/A"},{"$error":"#N/A"},{"$error":"#N/A"},{"$error":"#N/A"},{"$f":"VLOOKUP($F186,VegTypeParameters!$A:$H,8,FALSE)","v":{"$error":"#N/A"}},".",".",".","."]
[3,23,0,0,null,null,null,{"$f":"VLOOKUP(F187,VegTypeParameters!A:G,2,FALSE)","v":{"$error":"#N/A"}},{"$f":"VLOOKUP($F187,VegTypeParameters!$A:$G,5,FALSE)","v":{"$error":"#N/A"}},{"$f":"VLOOKUP($F187,VegTypeParameters!$A:$G,4,FALSE)","v":{"$error":"#N/A"}},{"$f":"G187+FieldBeeForm!$E$11","v":12},{"$error":"#N/A"},{"$f":"(VLOOKUP($F187,VegTypeParameters!A:G,6,FALSE))","v":{"$error":"#N/A"}},{"$f":"(VLOOKUP($F187,VegTypeParameters!A:G,7,FALSE))","v":{"$error":"#N/A"}},{"$error":"#N/A"},null,{"$error":"#N/A"},{"$error":"#N/A"},{"$error":"#N/A"},{"$error":"#N/A"},{"$error":"#N/A"},{"$f":"VLOOKUP($F187,VegTypeParameters!$A:$H,8,FALSE)","v":{"$error":"#N/A"}},".",".",".","."]
[3,24,0,0,null,null,null,{"$f":"VLOOKUP(F188,VegTypeParameters!A:G,2,FALSE)","v":{"$error":"#N/A"}},{"$f":"VLOOKUP($F188,VegTypeParameters!$A:$G,5,FALSE)","v":{"$error":"#N/A"}},{"$f":"VLOOKUP($F188,VegTypeParameters!$A:$G,4,FALSE)","v":{"$error":"#N/A"}},{"$f":"G188+FieldBeeForm!$E$11","v":12},{"$error":"#N/A"},{"$f":"(VLOOKUP($F188,VegTypeParameters!A:G,6,FALSE))","v":{"$error":"#N/A"}},{"$f":"(VLOOKUP($F188,VegTypeParameters!A:G,7,FALSE))","v":{"$error":"#N/A"}},{"$error":"#N/A"},null,{"$error":"#N/A"},{"$error":"#N/A"},{"$error":"#N/A"},{"$error":"#N/A"},{"$error":"#N/A"},{"$f":"VLOOKUP($F188,VegTypeParameters!$A:$H,8,FALSE)","v":{"$error":"#N/A"}},".",".",".","."]
[3,25,0,0,null,null,null,{"$f":"VLOOKUP(F189,VegTypeParameters!A:G,2,FALSE)","v":{"$error":"#N/A"}},{"$f":"VLOOKUP($F189,VegTypeParameters!$A:$G,5,FALSE)","v":{"$error":"#N/A"}},{"$f":"VLOOKUP($F189,VegTypeParameters!$A:$G,4,FALSE)","v":{"$error":"#N/A"}},{"$f":"G189+FieldBeeForm!$E$11","v":12},{"$f":"IF(J189>0,J189*(1-EXP(-I189*K189/J189)), 0)","v":{"$error":"#N/A"}},{"$f":"(VLOOKUP($F189,VegTypeParameters!A:G,6,FALSE))","v":{"$error":"#N/A"}},{"$f":"(VLOOKUP($F189,VegTypeParameters!A:G,7,FALSE))","v":{"$error":"#N/A"}},{"$f":"IF(M189>0, (M189*(1-EXP(-N189*G189/M189)))*(M189*(1-EXP(-N189*G189/M189))),0)","v":{"$error":"#N/A"}},null,{"$f":"IF(O189>0, (D189*E189)/O189,0)","v":{"$error":"#N/A"}},{"$f":"IF(M189>0, (M189*(1-EXP(-N189*K189/M189)))*(M189*(1-EXP(-N189*K189/M189))), 0)","v":{"$error":"#N/A"}},{"$f":"IF(M189>0,(M189*(1-EXP(-N189*K189/M189)))*L189,0)","v":{"$error":"#N/A"}},{"$error":"#N/A"},{"$error":"#N/A"},{"$f":"VLOOKUP($F189,VegTypeParameters!$A:$H,8,FALSE)","v":{"$error":"#N/A"}},".",".",".","."]
[3,26,0,0,null,null,null,{"$f":"VLOOKUP(F190,VegTypeParameters!A:G,2,FALSE)","v":{"$error":"#N/A"}},{"$f":"VLOOKUP($F190,VegTypeParameters!$A:$G,5,FALSE)","v":{"$error":"#N/A"}},{"$f":"VLOOKUP($F190,VegTypeParameters!$A:$G,4,FALSE)","v":{"$error":"#N/A"}},{"$f":"G190+FieldBeeForm!$E$11","v":12},{"$f":"IF(J190>0,J190*(1-EXP(-I190*K190/J190)), 0)","v":{"$error":"#N/A"}},{"$f":"(VLOOKUP($F190,VegTypeParameters!A:G,6,FALSE))","v":{"$error":"#N/A"}},{"$f":"(VLOOKUP($F190,VegTypeParameters!A:G,7,FALSE))","v":{"$error":"#N/A"}},{"$f":"IF(M190>0, (M190*(1-EXP(-N190*G190/M190)))*(M190*(1-EXP(-N190*G190/M190))),0)","v":{"$error":"#N/A"}},null,{"$f":"IF(O190>0, (D190*E190)/O190,0)","v":{"$error":"#N/A"}},{"$f":"IF(M190>0, (M190*(1-EXP(-N190*K190/M190)))*(M190*(1-EXP(-N190*K190/M190))), 0)","v":{"$error":"#N/A"}},{"$f":"IF(M190>0,(M190*(1-EXP(-N190*K190/M190)))*L190,0)","v":{"$error":"#N/A"}},{"$error":"#N/A"},{"$error":"#N/A"},{"$f":"VLOOKUP($F190,VegTypeParameters!$A:$H,8,FALSE)","v":{"$error":"#N/A"}},".",".",".","."]
[3,27,0,0,null,null,null,{"$f":"VLOOKUP(F191,VegTypeParameters!A:G,2,FALSE)","v":{"$error":"#N/A"}},{"$f":"VLOOKUP($F191,VegTypeParameters!$A:$G,5,FALSE)","v":{"$error":"#N/A"}},{"$f":"VLOOKUP($F191,VegTypeParameters!$A:$G,4,FALSE)","v":{"$error":"#N/A"}},{"$f":"G191+FieldBeeForm!$E$11","v":12},{"$error":"#N/A"},{"$f":"(VLOOKUP($F191,VegTypeParameters!A:G,6,FALSE))","v":{"$error":"#N/A"}},{"$f":"(VLOOKUP($F191,VegTypeParameters!A:G,7,FALSE))","v":{"$error":"#N/A"}},{"$error":"#N/A"},null,{"$error":"#N/A"},{"$error":"#N/A"},{"$error":"#N/A"},{"$error":"#N/A"},{"$error":"#N/A"},{"$f":"VLOOKUP($F191,VegTypeParameters!$A:$H,8,FALSE)","v":{"$error":"#N/A"}},".",".",".","."]
[3,28,0,0,null,null,null,{"$f":"VLOOKUP(F192,VegTypeParameters!A:G,2,FALSE)","v":{"$error":"#N/A"}},{"$f":"VLOOKUP($F192,VegTypeParameters!$A:$G,5,FALSE)","v":{"$error":"#N/A"}},{"$f":"VLOOKUP($F192,VegTypeParameters!$A:$G,4,FALSE)","v":{"$error":"#N/A"}},{"$f":"G192+FieldBeeForm!$E$11","v":12},{"$error":"#N/A"},{"$f":"(VLOOKUP($F192,VegTypeParameters!A:G,6,FALSE))","v":{"$error":"#N/A"}},{"$f":"(VLOOKUP($F192,VegTypeParameters!A:G,7,FALSE))","v":{"$error":"#N/A"}},{"$error":"#N/A"},null,{"$error":"#N/A"},{"$error":"#N/A"},{"$error":"#N/A"},{"$error":"#N/A"},{"$error":"#N/A"},{"$f":"VLOOKUP($F192,VegTypeParameters!$A:$H,8,FALSE)","v":{"$error":"#N/A"}},".",".",".","."]
[3,29,0,0,null,null,null,{"$f":"VLOOKUP(F193,VegTypeParameters!A:G,2,FALSE)","v":{"$error":"#N/A"}},{"$f":"VLOOKUP($F193,VegTypeParameters!$A:$G,5,FALSE)","v":{"$error":"#N/A"}},{"$f":"VLOOKUP($F193,VegTypeParameters!$A:$G,4,FALSE)","v":{"$error":"#N/A"}},{"$f":"G193+FieldBeeForm!$E$11","v":12},{"$error":"#N/A"},{"$f":"(VLOOKUP($F193,VegTypeParameters!A:G,6,FALSE))","v":{"$error":"#N/A"}},{"$f":"(VLOOKUP($F193,VegTypeParameters!A:G,7,FALSE))","v":{"$error":"#N/A"}},{"$error":"#N/A"},null,{"$error":"#N/A"},{"$error":"#N/A"},{"$error":"#N/A"},{"$error":"#N/A"},{"$error":"#N/A"},{"$f":"VLOOKUP($F193,VegTypeParameters!$A:$H,8,FALSE)","v":{"$error":"#N/A"}},".",".",".","."]
[3,30,0,0,null,null,null,{"$f":"VLOOKUP(F194,VegTypeParameters!A:G,2,FALSE)","v":{"$error":"#N/A"}},{"$f":"VLOOKUP($F194,VegTypeParameters!$A:$G,5,FALSE)","v":{"$error":"#N/A"}},{"$f":"VLOOKUP($F194,VegTypeParameters!$A:$G,4,FALSE)","v":{"$error":"#N/A"}},{"$f":"G194+FieldBeeForm!$E$11","v":12},{"$error":"#N/A"},{"$f":"(VLOOKUP($F194,VegTypeParameters!A:G,6,FALSE))","v":{"$error":"#N/A"}},{"$f":"(VLOOKUP($F194,VegTypeParameters!A:G,7,FALSE))","v":{"$error":"#N/A"}},{"$error":"#N/A"},null,{"$error":"#N/A"},{"$error":"#N/A"},{"$error":"#N/A"},{"$error":"#N/A"},{"$error":"#N/A"},{"$f":"VLOOKUP($F194,VegTypeParameters!$A:$H,8,FALSE)","v":{"$error":"#N/A"}},".",".",".","."]
[3,31,0,0,null,null,null,{"$f":"VLOOKUP(F195,VegTypeParameters!A:G,2,FALSE)","v":{"$error":"#N/A"}},{"$f":"VLOOKUP($F195,VegTypeParameters!$A:$G,5,FALSE)","v":{"$error":"#N/A"}},{"$f":"VLOOKUP($F195,VegTypeParameters!$A:$G,4,FALSE)","v":{"$error":"#N/A"}},{"$f":"G195+FieldBeeForm!$E$11","v":12},{"$error":"#N/A"},{"$f":"(VLOOKUP($F195,VegTypeParameters!A:G,6,FALSE))","v":{"$error":"#N/A"}},{"$f":"(VLOOKUP($F195,VegTypeParameters!A:G,7,FALSE))","v":{"$error":"#N/A"}},{"$error":"#N/A"},null,{"$error":"#N/A"},{"$error":"#N/A"},{"$error":"#N/A"},{"$error":"#N/A"},{"$error":"#N/A"},{"$f":"VLOOKUP($F195,VegTypeParameters!$A:$H,8,FALSE)","v":{"$error":"#N/A"}},".",".",".","."]
[3,32,0,0,null,null,null,{"$f":"VLOOKUP(F196,VegTypeParameters!A:G,2,FALSE)","v":{"$error":"#N/A"}},{"$f":"VLOOKUP($F196,VegTypeParameters!$A:$G,5,FALSE)","v":{"$error":"#N/A"}},{"$f":"VLOOKUP($F196,VegTypeParameters!$A:$G,4,FALSE)","v":{"$error":"#N/A"}},{"$f":"G196+FieldBeeForm!$E$11","v":12},{"$error":"#N/A"},{"$f":"(VLOOKUP($F196,VegTypeParameters!A:G,6,FALSE))","v":{"$error":"#N/A"}},{"$f":"(VLOOKUP($F196,VegTypeParameters!A:G,7,FALSE))","v":{"$error":"#N/A"}},{"$error":"#N/A"},null,{"$error":"#N/A"},{"$error":"#N/A"},{"$error":"#N/A"},{"$error":"#N/A"},{"$error":"#N/A"},{"$f":"VLOOKUP($F196,VegTypeParameters!$A:$H,8,FALSE)","v":{"$error":"#N/A"}},".",".",".","."]
[3,33,0,0,null,null,null,{"$f":"VLOOKUP(F197,VegTypeParameters!A:G,2,FALSE)","v":{"$error":"#N/A"}},{"$f":"VLOOKUP($F197,VegTypeParameters!$A:$G,5,FALSE)","v":{"$error":"#N/A"}},{"$f":"VLOOKUP($F197,VegTypeParameters!$A:$G,4,FALSE)","v":{"$error":"#N/A"}},{"$f":"G197+FieldBeeForm!$E$11","v":12},{"$error":"#N/A"},{"$f":"(VLOOKUP($F197,VegTypeParameters!A:G,6,FALSE))","v":{"$error":"#N/A"}},{"$f":"(VLOOKUP($F197,VegTypeParameters!A:G,7,FALSE))","v":{"$error":"#N/A"}},{"$error":"#N/A"},null,{"$error":"#N/A"},{"$error":"#N/A"},{"$error":"#N/A"},{"$error":"#N/A"},{"$error":"#N/A"},{"$f":"VLOOKUP($F197,VegTypeParameters!$A:$H,8,FALSE)","v":{"$error":"#N/A"}},".",".",".","."]
[3,34,0,0,null,null,null,{"$f":"VLOOKUP(F198,VegTypeParameters!A:G,2,FALSE)","v":{"$error":"#N/A"}},{"$f":"VLOOKUP($F198,VegTypeParameters!$A:$G,5,FALSE)","v":{"$error":"#N/A"}},{"$f":"VLOOKUP($F198,VegTypeParameters!$A:$G,4,FALSE)","v":{"$error":"#N/A"}},{"$f":"G198+FieldBeeForm!$E$11","v":12},{"$error":"#N/A"},{"$f":"(VLOOKUP($F198,VegTypeParameters!A:G,6,FALSE))","v":{"$error":"#N/A"}},{"$f":"(VLOOKUP($F198,VegTypeParameters!A:G,7,FALSE))","v":{"$error":"#N/A"}},{"$error":"#N/A"},null,{"$error":"#N/A"},{"$error":"#N/A"},{"$error":"#N/A"},{"$error":"#N/A"},{"$error":"#N/A"},{"$f":"VLOOKUP($F198,VegTypeParameters!$A:$H,8,FALSE)","v":{"$error":"#N/A"}},".",".",".","."]
[3,35,0,0,null,null,null,{"$f":"VLOOKUP(F199,VegTypeParameters!A:G,2,FALSE)","v":{"$error":"#N/A"}},{"$f":"VLOOKUP($F199,VegTypeParameters!$A:$G,5,FALSE)","v":{"$error":"#N/A"}},{"$f":"VLOOKUP($F199,VegTypeParameters!$A:$G,4,FALSE)","v":{"$error":"#N/A"}},{"$f":"G199+FieldBeeForm!$E$11","v":12},{"$error":"#N/A"},{"$f":"(VLOOKUP($F199,VegTypeParameters!A:G,6,FALSE))","v":{"$error":"#N/A"}},{"$f":"(VLOOKUP($F199,VegTypeParameters!A:G,7,FALSE))","v":{"$error":"#N/A"}},{"$error":"#N/A"},null,{"$error":"#N/A"},{"$error":"#N/A"},{"$error":"#N/A"},{"$error":"#N/A"},{"$error":"#N/A"},{"$f":"VLOOKUP($F199,VegTypeParameters!$A:$H,8,FALSE)","v":{"$error":"#N/A"}},".",".",".","."]
[null,null,null,"Horizontal extent of pollinator plant cover (m2) per season",null,null,null,"Vertical extent of pollinator plant cover (m2) per season",null,null,null,"Number of different pollinator plant species per season"]
["Map Unit #","Vegetation Entry",null,"Spatial extent of Veg Type (m2)","Early","Mid","Late","Spatial extent of Veg Type (m2)","Early","Mid","Late","Early","Mid","Late"]
[{"$f":"A165","v":3},{"$f":"B165","v":1},null,{"$f":"+IF(ISNA(VLOOKUP(B202,B$165:D$199, 3, FALSE)),0,VLOOKUP(B202,B$165:D$199, 3, FALSE))","v":0},{"$f":"+IF(SUMIFS(T$165:T$199, B$165:B$199, $B202, V$165:V$199, \"*\"&\"Early\"&\"*\") <=$D202, SUMIFS(T$165:T$199, B$165:B$199, $B202, V$165:V$199, \"*\"&\"Early\"&\"*\"), $D202)","v":0},{"$f":"+IF(SUMIFS(T$165:T$199,B$165:B$199, $B202, V$165:V$199, \"*\"&\"Mid\"&\"*\") <=$D202, SUMIFS(T$165:T$199,B$165:B$199, $B202, V$165:V$199, \"*\"&\"Mid\"&\"*\"), $D202)","v":0},{"$f":"+IF(SUMIFS(T$165:T$199, B$165:B$199, $B202, $V$165:$V$199, \"*\"&\"Late\"&\"*\") <=$D202, SUMIFS(T$165:T$199,B$165:B$199, $B202,$V$165:$V$199, \"*\"&\"Late\"&\"*\"), $D202)","v":0},{"$f":"+IF(ISNA(VLOOKUP(B202,B$165:D$199, 3, FALSE)),0,VLOOKUP(B202,B$165:D$199, 3, FALSE))","v":0},{"$f":"+IF(SUMIFS($U$165:$U$199, $B$165:$B$199, $B202, $V$165:$V$199, \"*\"&\"Early\"&\"*\") <=$D202, SUMIFS($U$165:$U$199, $B$165:$B$199, $B202, $V$165:$V$199, \"*\"&\"Early\"&\"*\"), $D202)","v":0},{"$f":"+IF(SUMIFS($U$165:$U$199, $B$165:$B$199, $B202, $V$165:$V$199, \"*\"&\"Mid\"&\"*\") <=$D202, SUMIFS($U$165:$U$199, $B$165:$B$199, $B202, $V$165:$V$199, \"*\"&\"Mid\"&\"*\"), $D202)","v":0},{"$f":"+IF(SUMIFS($U$165:$U$199, $B$165:$B$199, $B202, $V$165:$V$199, \"*\"&\"Late\"&\"*\") <=$D202, SUMIFS($U$165:$U$199, $B$165:$B$199, $B202, $V$165:$V$199, \"*\"&\"Late\"&\"*\"), $D202)","v":0}," "]
[{"$f":"A166","v":3},2,null,{"$f":"+IF(ISNA(VLOOKUP(B203,B$165:D$199, 3, FALSE)),0,VLOOKUP(B203,B$165:D$199, 3, FALSE))","v":0},{"$f":"+IF(SUMIFS(T$165:T$199, B$165:B$199, $B203, V$165:V$199, \"*\"&\"Early\"&\"*\") <=$D203, SUMIFS(T$165:T$199, B$165:B$199, $B203, V$165:V$199, \"*\"&\"Early\"&\"*\"), $D203)","v":0},{"$f":"+IF(SUMIFS(T$165:T$199,B$165:B$199, $B203, V$165:V$199, \"*\"&\"Mid\"&\"*\") <=$D203, SUMIFS(T$165:T$199,B$165:B$199, $B203, V$165:V$199, \"*\"&\"Mid\"&\"*\"), $D203)","v":0},{"$f":"+IF(SUMIFS(T$165:T$199, B$165:B$199, $B203, $V$165:$V$199, \"*\"&\"Late\"&\"*\") <=$D203, SUMIFS(T$165:T$199,B$165:B$199, $B203,$V$165:$V$199, \"*\"&\"Late\"&\"*\"), $D203)","v":0},{"$f":"+IF(ISNA(VLOOKUP(B203,B$165:D$199, 3, FALSE)),0,VLOOKUP(B203,B$165:D$199, 3, FALSE))","v":0},{"$f":"+IF(SUMIFS($U$165:$U$199, $B$165:$B$199, $B203, $V$165:$V$199, \"*\"&\"Early\"&\"*\") <=$D203, SUMIFS($U$165:$U$199, $B$165:$B$199, $B203, $V$165:$V$199, \"*\"&\"Early\"&\"*\"), $D203)","v":0},{"$f":"+IF(SUMIFS($U$165:$U$199, $B$165:$B$199, $B203, $V$165:$V$199, \"*\"&\"Mid\"&\"*\") <=$D203, SUMIFS($U$165:$U$199, $B$165:$B$199, $B203, $V$165:$V$199, \"*\"&\"Mid\"&\"*\"), $D203)","v":0},{"$f":"+IF(SUMIFS($U$165:$U$199, $B$165:$B$199, $B203, $V$165:$V$199, \"*\"&\"Late\"&\"*\") <=$D203, SUMIFS($U$165:$U$199, $B$165:$B$199, $B203, $V$165:$V$199, \"*\"&\"Late\"&\"*\"), $D203)","v":0}," "]
[{"$f":"A167","v":3},3,null,0,0,0,0,0,0,0,0]
[{"$f":"A168","v":3},4,null,0,0,0,0,0,0,0,0]
[{"$f":"A169","v":3},5,null,0,0,0,0,0,0,0,0]
[{"$f":"A170","v":3},6,null,0,0,0,0,0,0,0,0]
[{"$f":"A171","v":3},7,null,0,0,0,0,0,0,0,0]
[{"$f":"A172","v":3},8,null,0,0,0,0,0,0,0,0]
[{"$f":"A173","v":3},9,null,0,0,0,0,0,0,0,0]
[{"$f":"A174","v":3},10,null,0,0,0,0,0,0,0,0]
[{"$f":"A175","v":3},11,null,{"$f":"+IF(ISNA(VLOOKUP(B212,B$165:D$199, 3, FALSE)),0,VLOOKUP(B212,B$165:D$199, 3, FALSE))","v":0},{"$f":"+IF(SUMIFS(T$165:T$199, B$165:B$199, $B212, V$165:V$199, \"*\"&\"Early\"&\"*\") <=$D212, SUMIFS(T$165:T$199, B$165:B$199, $B212, V$165:V$199, \"*\"&\"Early\"&\"*\"), $D212)","v":0},{"$f":"+IF(SUMIFS(T$165:T$199,B$165:B$199, $B212, V$165:V$199, \"*\"&\"Mid\"&\"*\") <=$D212, SUMIFS(T$165:T$199,B$165:B$199, $B212, V$165:V$199, \"*\"&\"Mid\"&\"*\"), $D212)","v":0},{"$f":"+IF(SUMIFS(T$165:T$199, B$165:B$199, $B212, $V$165:$V$199, \"*\"&\"Late\"&\"*\") <=$D212, SUMIFS(T$165:T$199,B$165:B$199, $B212,$V$165:$V$199, \"*\"&\"Late\"&\"*\"), $D212)","v":0},{"$f":"+IF(ISNA(VLOOKUP(B212,B$165:D$199, 3, FALSE)),0,VLOOKUP(B212,B$165:D$199, 3, FALSE))","v":0},0,0,0]
[{"$f":"A176","v":3},12,null,0,0,0,0,0,0,0,0]
[{"$f":"A177","v":3},13,null,0,0,0,0,0,0,0,0]
[{"$f":"A178","v":3},14,null,0,0,0,0,0,0,0,0]
[{"$f":"A179","v":3},15,null,0,0,0,0,0,0,0,0]
[{"$f":"A180","v":3},16,null,0,0,0,0,0,0,0,0]
[{"$f":"A181","v":3},17,null,0,0,0,0,0,0,0,0]
[{"$f":"A182","v":3},18,null,0,0,0,0,0,0,0,0]
[{"$f":"A183","v":3},19,null,0,0,0,0,0,0,0,0]
[{"$f":"A184","v":3},20,null,0,0,0,0,0,0,0,0]
[{"$f":"A185","v":3},21,null,0,0,0,0,0,0,0,0]
[{"$f":"A186","v":3},22,null,0,0,0,0,0,0,0,0]
[{"$f":"A187","v":3},23,null,0,0,0,0,0,0,0,0]
[{"$f":"A188","v":3},24,null,0,0,0,0,0,0,0,0]
[{"$f":"A189","v":3},25,null,0,0,0,0,0,0,0,0]
[{"$f":"A190","v":3},26,null,0,0,0,0,0,0,0,0]
[{"$f":"A191","v":3},27,null,0,0,0,0,0,0,0,0]
[{"$f":"A192","v":3},28,null,0,0,0,0,0,0,0,0]
[{"$f":"A193","v":3},29,null,0,0,0,0,0,0,0,0]
[{"$f":"A194","v":3},30,null,0,0,0,0,0,0,0,0]
[{"$f":"A195","v":3},31,null,0,0,0,0,0,0,0,0]
[{"$f":"A196","v":3},32,null,0,0,0,0,0,0,0,0]
[{"$f":"A197","v":3},33,null,0,0,0,0,0,0,0,0]
[{"$f":"A198","v":3},34,null,0,0,0,0,0,0,0,0]
[{"$f":"A199","v":3},35,null,0,0,0,0,0,0,0,0]
[{"$f":"A165","v":3},"Total",null,{"$f":"+SUM(D202:D236)","v":0},{"$f":"+SUM(E202:E236)","v":0},0,0,0,0,0,0,{"$f":"+X164","v":7},{"$f":"+Y164","v":10},{"$f":"+Z164","v":7}]
[null," ",null,{"$f":"D237","v":0},"Map Unit Size in Acres",null,{"$f":"FieldBeeForm!G14","v":300000},"Value entered in FieldBeeForm (Should be same as cell C163)"]
[]
["Enter only in yellow cells. Leave rest untouched.",null,null,null,null,null,"Enter the current year age in column G for each vegetation type. This age will be added to the assessment year (input on Field data form) to determine time series age in column K. If you are interested in just the current effects, enter a '0' in cell E11 of the Field data form."]
["Map Unit","Vegetation Entry","Map Unit Size","Spatial extent of Veg Type","Existing Cover Class for VegType","Species/ VegType","Existing Age of Average Plant \n(for S enter 1, for Sa enter 2, for P enter 3, for M enter 5, for D enter 10)","Species/Vegetation Type Descriptions","Ht Rate","Ht max","Future Age","Future Height","Canopy Width Max (m)","Canopy Width Rate","Existing Age canopy area per plant",null,"Estimated # Individuals","Future Horizontal Surface Area per plant (width x width)","Future Vertical Surface Area per plant (width x height)","Horizontal Surface Area Across Map Unit","Vertical Surface Area Across Map Unit","Season(s)","Season(s) (.)","Early","Mid","Late"]
["#","#"," sq ft","m2","%","code","yrs",null,"m/yr","m","yrs","m","m","m/yr","m2",null,"number","m2","m2","m2","m2",null,null,{"$f":"SUM(IF(FREQUENCY(MATCH(X243:X277, X243:X277,0),MATCH(X243:X277, X243:X277,0))>0,1))-1","v":7},{"$f":"SUM(IF(FREQUENCY(MATCH(Y243:Y277, Y243:Y277,0),MATCH(Y243:Y277, Y243:Y277,0))>0,1))-1","v":10},{"$f":"SUM(IF(FREQUENCY(MATCH(Z243:Z277, Z243:Z277,0),MATCH(Z243:Z277, Z243:Z277,0))>0,1))-1","v":7}]
[4,1,null,{"$f":"(0.092903*C243)*E243","v":0},0.06,1600,5,{"$f":"VLOOKUP(F243,VegTypeParameters!A:G,2,FALSE)","v":"Atriplex"},{"$f":"VLOOKUP($F243,VegTypeParameters!$A:$G,5,FALSE)","v":3.2962962962962963},{"$f":"VLOOKUP($F243,VegTypeParameters!$A:$G,4,FALSE)","v":3},{"$f":"G243+FieldBeeForm!$E$11","v":17},{"$f":"IF(J243>0,J243*(1-EXP(-I243*K243/J243)), 0)","v":2.9999999768298276},{"$f":"(VLOOKUP($F243,VegTypeParameters!A:G,6,FALSE))","v":5},{"$f":"(VLOOKUP($F243,VegTypeParameters!A:G,7,FALSE))","v":7.1111111111111107},{"$f":"IF(M243>0, (M243*(1-EXP(-N243*G243/M243)))*(M243*(1-EXP(-N243*G243/M243))),0)","v":24.959217254150069},null,{"$f":"IF(O243>0, (D243*E243)/O243,0)","v":0},{"$f":"IF(M243>0, (M243*(1-EXP(-N243*K243/M243)))*(M243*(1-EXP(-N243*K243/M243))), 0)","v":24.99999999841986},{"$f":"IF(M243>0,(M243*(1-EXP(-N243*K243/M243)))*L243,0)","v":14.999999883675097},{"$f":"R243*Q243","v":0},{"$f":"S243*Q243","v":0},{"$f":"VLOOKUP($F243,VegTypeParameters!$A:$H,8,FALSE)","v":"Mid/Late"},{"$f":"+IF(ISNA(V243), \".\",  V243)","v":"Mid/Late"},{"$f":"IF($W243=\"Early/Mid\",$H243,IF($W243=\"Early\", $H243, IF($W243=\"Early/Mid/Late\", $H243,\".\")))","v":"."},{"$f":"IF($W243=\"Early/Mid\",$H243,IF($W243=\"Mid\", $H243, IF($W243=\"Mid/Late\", $H243, IF($W243=\"Early/Mid/Late\", $H243,\".\"))))","v":"Atriplex"},{"$f":"IF($W243=\"Mid/Late\",$H243,IF($W243=\"Late\", $H243, IF($W243=\"Early/Mid/Late\", $H243,\".\")))","v":"Atriplex"}]
[4,2,{"$f":"C$243","v":0},{"$f":"(0.092903*C244)*E244","v":0},0.03,4200,3,{"$f":"VLOOKUP(F244,VegTypeParameters!A:G,2,FALSE)","v":"Helianthus"},{"$f":"VLOOKUP($F244,VegTypeParameters!$A:$G,5,FALSE)","v":6.5},{"$f":"VLOOKUP($F244,VegTypeParameters!$A:$G,4,FALSE)","v":2.5},{"$f":"G244+FieldBeeForm!$E$11","v":15},2.5,{"$f":"(VLOOKUP($F244,VegTypeParameters!A:G,6,FALSE))","v":0.75},{"$f":"(VLOOKUP($F244,VegTypeParameters!A:G,7,FALSE))","v":1.25},0.55494534708652032,null,0,0.56249999998437616,1.8749999999739604,0,0,{"$f":"VLOOKUP($F244,VegTypeParameters!$A:$H,8,FALSE)","v":"Mid/Late"},{"$f":"+IF(ISNA(V244), \".\",  V244)","v":"Mid/Late"},{"$f":"IF($W244=\"Early/Mid\",$H244,IF($W244=\"Early\", $H244, IF($W244=\"Early/Mid/Late\", $H244,\".\")))","v":"."},{"$f":"IF($W244=\"Early/Mid\",$H244,IF($W244=\"Mid\", $H244, IF($W244=\"Mid/Late\", $H244, IF($W244=\"Early/Mid/Late\", $H244,\".\"))))","v":"Helianthus"},{"$f":"IF($W244=\"Mid/Late\",$H244,IF($W244=\"Late\", $H244, IF($W244=\"Early/Mid/Late\", $H244,\".\")))","v":"Helianthus"}]
[4,3,{"$f":"C$243","v":0},0,0.08,4000,3,{"$f":"VLOOKUP(F245,VegTypeParameters!A:G,2,FALSE)","v":"Grindelia"},{"$f":"VLOOKUP($F245,VegTypeParameters!$A:$G,5,FALSE)","v":1.6666666666666667},{"$f":"VLOOKUP($F245,VegTypeParameters!$A:$G,4,FALSE)","v":2.5},{"$f":"G245+FieldBeeForm!$E$11","v":15},2.4998865001755939,{"$f":"(VLOOKUP($F245,VegTypeParameters!A:G,6,FALSE))","v":2},{"$f":"(VLOOKUP($F245,VegTypeParameters!A:G,7,FALSE))","v":1.3333333333333333},2.9905802896620353,null,0,3.9996368088065144,4.9995460110081433,0,0,{"$f":"VLOOKUP($F245,VegTypeParameters!$A:$H,8,FALSE)","v":"Mid/Late"},"Mid/Late",".","Grindelia","Grindelia"]
[4,4,0,0,0.08,7000,3,{"$f":"VLOOKUP(F246,VegTypeParameters!A:G,2,FALSE)","v":"Salix (shrub)"},{"$f":"VLOOKUP($F246,VegTypeParameters!$A:$G,5,FALSE)","v":0.73},{"$f":"VLOOKUP($F246,VegTypeParameters!$A:$G,4,FALSE)","v":3.5},{"$f":"G246+FieldBeeForm!$E$11","v":15},3.3467689644197414,{"$f":"(VLOOKUP($F246,VegTypeParameters!A:G,6,FALSE))","v":2.5},{"$f":"(VLOOKUP($F246,VegTypeParameters!A:G,7,FALSE))","v":0.55000000000000004},1.4589539561403246,null,0,5.7974627077191743,8.0583238111294335,0,0,{"$f":"VLOOKUP($F246,VegTypeParameters!$A:$H,8,FALSE)","v":"Early"},"Early","Salix (shrub)",".","."]
[4,5,0,0,0.08,8400,5,{"$f":"VLOOKUP(F247,VegTypeParameters!A:G,2,FALSE)","v":"Weeds, non-invasive and not beneficial to pollinators"},{"$f":"VLOOKUP($F247,VegTypeParameters!$A:$G,5,FALSE)","v":0},{"$f":"VLOOKUP($F247,VegTypeParameters!$A:$G,4,FALSE)","v":0},{"$f":"G247+FieldBeeForm!$E$11","v":17},0,{"$f":"(VLOOKUP($F247,VegTypeParameters!A:G,6,FALSE))","v":0},{"$f":"(VLOOKUP($F247,VegTypeParameters!A:G,7,FALSE))","v":0},0,null,0,0,0,0,0,{"$f":"VLOOKUP($F247,VegTypeParameters!$A:$H,8,FALSE)","v":"Never"},"Never",".",".","."]
[4,6,0,0,0.08,5300,3,{"$f":"VLOOKUP(F248,VegTypeParameters!A:G,2,FALSE)","v":"Medicago "},{"$f":"VLOOKUP($F248,VegTypeParameters!$A:$G,5,FALSE)","v":0.5},{"$f":"VLOOKUP($F248,VegTypeParameters!$A:$G,4,FALSE)","v":0.5},{"$f":"G248+FieldBeeForm!$E$11","v":15},0.49999984704883976,{"$f":"(VLOOKUP($F248,VegTypeParameters!A:G,6,FALSE))","v":0.7},{"$f":"(VLOOKUP($F248,VegTypeParameters!A:G,7,FALSE))","v":0.7},0.44242326156605982,null,0,0.48999970021577172,0.34999978586840841,0,0,{"$f":"VLOOKUP($F248,VegTypeParameters!$A:$H,8,FALSE)","v":"Mid/Late"},"Mid/Late",".","Medicago ","Medicago "]
[4,7,0,0,0.08,1600,3,{"$f":"VLOOKUP(F249,VegTypeParameters!A:G,2,FALSE)","v":"Atriplex"},{"$f":"VLOOKUP($F249,VegTypeParameters!$A:$G,5,FALSE)","v":3.2962962962962963},{"$f":"VLOOKUP($F249,VegTypeParameters!$A:$G,4,FALSE)","v":3},{"$f":"G249+FieldBeeForm!$E$11","v":15},2.999999791404568,{"$f":"(VLOOKUP($F249,VegTypeParameters!A:G,6,FALSE))","v":5},{"$f":"(VLOOKUP($F249,VegTypeParameters!A:G,7,FALSE))","v":7.1111111111111107},24.303496604054391,null,0,24.999999972834292,14.999998948873127,0,0,{"$f":"VLOOKUP($F249,VegTypeParameters!$A:$H,8,FALSE)","v":"Mid/Late"},"Mid/Late",".","Atriplex","Atriplex"]
[4,8,0,0,0.03,7500,3,{"$f":"VLOOKUP(F250,VegTypeParameters!A:G,2,FALSE)","v":"Scrophularia"},{"$f":"VLOOKUP($F250,VegTypeParameters!$A:$G,5,FALSE)","v":1.2},{"$f":"VLOOKUP($F250,VegTypeParameters!$A:$G,4,FALSE)","v":1.2},{"$f":"G250+FieldBeeForm!$E$11","v":15},1.1999996329172153,{"$f":"(VLOOKUP($F250,VegTypeParameters!A:G,6,FALSE))","v":0.3},{"$f":"(VLOOKUP($F250,VegTypeParameters!A:G,7,FALSE))","v":0.3},8.1261415389684455E-2,null,0,8.9999944937590726E-2,0.3599997797503629,0,0,{"$f":"VLOOKUP($F250,VegTypeParameters!$A:$H,8,FALSE)","v":"Early/Mid"},"Early/Mid","Scrophularia","Scrophularia","."]
[4,9,0,0,0.03,3500,3,{"$f":"VLOOKUP(F251,VegTypeParameters!A:G,2,FALSE)","v":"Ficus carica"},{"$f":"VLOOKUP($F251,VegTypeParameters!$A:$G,5,FALSE)","v":0},{"$f":"VLOOKUP($F251,VegTypeParameters!$A:$G,4,FALSE)","v":0},{"$f":"G251+FieldBeeForm!$E$11","v":15},0,{"$f":"(VLOOKUP($F251,VegTypeParameters!A:G,6,FALSE))","v":0},{"$f":"(VLOOKUP($F251,VegTypeParameters!A:G,7,FALSE))","v":0},0,null,0,0,0,0,0,{"$f":"VLOOKUP($F251,VegTypeParameters!$A:$H,8,FALSE)","v":"Never"},"Never",".",".","."]
[4,10,0,0,0.03,6200,3,{"$f":"VLOOKUP(F252,VegTypeParameters!A:G,2,FALSE)","v":"Other late blooming native plants beneficial to pollinators"},{"$f":"VLOOKUP($F252,VegTypeParameters!$A:$G,5,FALSE)","v":0.25},{"$f":"VLOOKUP($F252,VegTypeParameters!$A:$G,4,FALSE)","v":1},{"$f":"G252+FieldBeeForm!$E$11","v":15},0.97648225414399092,{"$f":"(VLOOKUP($F252,VegTypeParameters!A:G,6,FALSE))","v":0.5},{"$f":"(VLOOKUP($F252,VegTypeParameters!A:G,7,FALSE))","v":0.25},0.15088168701775109,null,0,0.24972353429050623,0.48797108853574861,0,0,{"$f":"VLOOKUP($F252,VegTypeParameters!$A:$H,8,FALSE)","v":"Late"},"Late",".",".","Other late blooming native plants beneficial to pollinators"]
[4,11,0,0,0.03,2500,3,{"$f":"VLOOKUP(F253,VegTypeParameters!A:G,2,FALSE)","v":"Clarkia"},{"$f":"VLOOKUP($F253,VegTypeParameters!$A:$G,5,FALSE)","v":0.4},{"$f":"VLOOKUP($F253,VegTypeParameters!$A:$G,4,FALSE)","v":0.4},{"$f":"G253+FieldBeeForm!$E$11","v":15},0.39999987763907185,{"$f":"(VLOOKUP($F253,VegTypeParameters!A:G,6,FALSE))","v":0.1},{"$f":"(VLOOKUP($F253,VegTypeParameters!A:G,7,FALSE))","v":0.1},9.029046154409387E-3,null,0,9.9999938819545289E-3,3.9999975527818116E-2,0,0,{"$f":"VLOOKUP($F253,VegTypeParameters!$A:$H,8,FALSE)","v":"Early/Mid"},"Early/Mid","Clarkia","Clarkia","."]
[4,12,0,0,0.08,5000,3,{"$f":"VLOOKUP(F254,VegTypeParameters!A:G,2,FALSE)","v":"Lupinus spp."},{"$f":"VLOOKUP($F254,VegTypeParameters!$A:$G,5,FALSE)","v":0.98000000000000009},{"$f":"VLOOKUP($F254,VegTypeParameters!$A:$G,4,FALSE)","v":3},{"$f":"G254+FieldBeeForm!$E$11","v":15},2.9776602507872267,{"$f":"(VLOOKUP($F254,VegTypeParameters!A:G,6,FALSE))","v":3},{"$f":"(VLOOKUP($F254,VegTypeParameters!A:G,7,FALSE))","v":1.08},3.925206627733659,null,0,8.9188851385636738,8.8926342217348378,0,0,{"$f":"VLOOKUP($F254,VegTypeParameters!$A:$H,8,FALSE)","v":"Early/Mid/Late"},"Early/Mid/Late","Lupinus spp.","Lupinus spp.","Lupinus spp."]
[4,13,0,0,0.08,6000,3,{"$f":"VLOOKUP(F255,VegTypeParameters!A:G,2,FALSE)","v":"Orchard"},{"$f":"VLOOKUP($F255,VegTypeParameters!$A:$G,5,FALSE)","v":0.5},{"$f":"VLOOKUP($F255,VegTypeParameters!$A:$G,4,FALSE)","v":10},{"$f":"G255+FieldBeeForm!$E$11","v":15},5.2763344725898529,{"$f":"(VLOOKUP($F255,VegTypeParameters!A:G,6,FALSE))","v":6},{"$f":"(VLOOKUP($F255,VegTypeParameters!A:G,7,FALSE))","v":0.5},1.7614473685136525,null,0,18.326714576526665,22.58783601812447,0,0,{"$f":"VLOOKUP($F255,VegTypeParameters!$A:$H,8,FALSE)","v":"Early"},"Early","Orchard",".","."]
[4,14,0,0,0.03,3300,5,{"$f":"VLOOKUP(F256,VegTypeParameters!A:G,2,FALSE)","v":"Eschscholzia"},{"$f":"VLOOKUP($F256,VegTypeParameters!$A:$G,5,FALSE)","v":0.6},{"$f":"VLOOKUP($F256,VegTypeParameters!$A:$G,4,FALSE)","v":0.3},{"$f":"G256+FieldBeeForm!$E$11","v":17},0.29999999999999949,{"$f":"(VLOOKUP($F256,VegTypeParameters!A:G,6,FALSE))","v":0.15},{"$f":"(VLOOKUP($F256,VegTypeParameters!A:G,7,FALSE))","v":0.3},2.2497957049536645E-2,null,0,2.2499999999999923E-2,4.4999999999999846E-2,0,0,{"$f":"VLOOKUP($F256,VegTypeParameters!$A:$H,8,FALSE)","v":"Early/Mid"},"Early/Mid","Eschscholzia","Eschscholzia","."]
[4,15,0,0,0.03,5600,3,{"$f":"VLOOKUP(F257,VegTypeParameters!A:G,2,FALSE)","v":"Native forbs and graminoids not beneficial to pollinators"},{"$f":"VLOOKUP($F257,VegTypeParameters!$A:$G,5,FALSE)","v":0},{"$f":"VLOOKUP($F257,VegTypeParameters!$A:$G,4,FALSE)","v":0},{"$f":"G257+FieldBeeForm!$E$11","v":15},{"$f":"IF(J257>0,J257*(1-EXP(-I257*K257/J257)), 0)","v":0},{"$f":"(VLOOKUP($F257,VegTypeParameters!A:G,6,FALSE))","v":0},{"$f":"(VLOOKUP($F257,VegTypeParameters!A:G,7,FALSE))","v":0},{"$f":"IF(M257>0, (M257*(1-EXP(-N257*G257/M257)))*(M257*(1-EXP(-N257*G257/M257))),0)","v":0},null,{"$f":"IF(O257>0, (D257*E257)/O257,0)","v":0},{"$f":"IF(M257>0, (M257*(1-EXP(-N257*K257/M257)))*(M257*(1-EXP(-N257*K257/M257))), 0)","v":0},{"$f":"IF(M257>0,(M257*(1-EXP(-N257*K257/M257)))*L257,0)","v":0},0,0,{"$f":"VLOOKUP($F257,VegTypeParameters!$A:$H,8,FALSE)","v":"Never"},"Never",".",".","."]
[4,16,0,0,0.08,3800,3,{"$f":"VLOOKUP(F258,VegTypeParameters!A:G,2,FALSE)","v":"Gilia"},{"$f":"VLOOKUP($F258,VegTypeParameters!$A:$G,5,FALSE)","v":0.6},{"$f":"VLOOKUP($F258,VegTypeParameters!$A:$G,4,FALSE)","v":0.3},{"$f":"G258+FieldBeeForm!$E$11","v":15},{"$f":"IF(J258>0,J258*(1-EXP(-I258*K258/J258)), 0)","v":0.2999999999999719},{"$f":"(VLOOKUP($F258,VegTypeParameters!A:G,6,FALSE))","v":0.15},{"$f":"(VLOOKUP($F258,VegTypeParameters!A:G,7,FALSE))","v":0.3},{"$f":"IF(M258>0, (M258*(1-EXP(-N258*G258/M258)))*(M258*(1-EXP(-N258*G258/M258))),0)","v":2.2388594396827964E-2},null,{"$f":"IF(O258>0, (D258*E258)/O258,0)","v":0},{"$f":"IF(M258>0, (M258*(1-EXP(-N258*K258/M258)))*(M258*(1-EXP(-N258*K258/M258))), 0)","v":2.2499999999995784E-2},{"$f":"IF(M258>0,(M258*(1-EXP(-N258*K258/M258)))*L258,0)","v":4.4999999999991568E-2},0,0,{"$f":"VLOOKUP($F258,VegTypeParameters!$A:$H,8,FALSE)","v":"Mid"},"Mid",".","Gilia","."]
[4,17,0,0,0.08,1500,3,{"$f":"VLOOKUP(F259,VegTypeParameters!A:G,2,FALSE)","v":"Asclepias"},{"$f":"VLOOKUP($F259,VegTypeParameters!$A:$G,5,FALSE)","v":0.8},{"$f":"VLOOKUP($F259,VegTypeParameters!$A:$G,4,FALSE)","v":0.8},{"$f":"G259+FieldBeeForm!$E$11","v":15},0.79999975527814371,{"$f":"(VLOOKUP($F259,VegTypeParameters!A:G,6,FALSE))","v":0.2},{"$f":"(VLOOKUP($F259,VegTypeParameters!A:G,7,FALSE))","v":0.2},3.6116184617637548E-2,null,0,3.9999975527818116E-2,0.15999990211127246,0,0,{"$f":"VLOOKUP($F259,VegTypeParameters!$A:$H,8,FALSE)","v":"Early/Mid/Late"},"Early/Mid/Late","Asclepias","Asclepias","Asclepias"]
[4,18,0,0,5.0000000000000001E-3,1600,1,{"$f":"VLOOKUP(F260,VegTypeParameters!A:G,2,FALSE)","v":"Atriplex"},{"$f":"VLOOKUP($F260,VegTypeParameters!$A:$G,5,FALSE)","v":3.2962962962962963},{"$f":"VLOOKUP($F260,VegTypeParameters!$A:$G,4,FALSE)","v":3},{"$f":"G260+FieldBeeForm!$E$11","v":13},2.9999981220660135,{"$f":"(VLOOKUP($F260,VegTypeParameters!A:G,6,FALSE))","v":5},{"$f":"(VLOOKUP($F260,VegTypeParameters!A:G,7,FALSE))","v":7.1111111111111107},14.395290762184326,null,0,24.999999532966985,14.999990470220251,0,0,{"$f":"VLOOKUP($F260,VegTypeParameters!$A:$H,8,FALSE)","v":"Mid/Late"},"Mid/Late",".","Atriplex","Atriplex"]
[4,19,0,0,null,null,null,{"$f":"VLOOKUP(F261,VegTypeParameters!A:G,2,FALSE)","v":{"$error":"#N/A"}},{"$f":"VLOOKUP($F261,VegTypeParameters!$A:$G,5,FALSE)","v":{"$error":"#N/A"}},{"$f":"VLOOKUP($F261,VegTypeParameters!$A:$G,4,FALSE)","v":{"$error":"#N/A"}},{"$f":"G261+FieldBeeForm!$E$11","v":12},{"$error":"#N/A"},{"$f":"(VLOOKUP($F261,VegTypeParameters!A:G,6,FALSE))","v":{"$error":"#N/A"}},{"$f":"(VLOOKUP($F261,VegTypeParameters!A:G,7,FALSE))","v":{"$error":"#N/A"}},{"$error":"#N/A"},null,{"$error":"#N/A"},{"$error":"#N/A"},{"$error":"#N/A"},{"$error":"#N/A"},{"$error":"#N/A"},{"$f":"VLOOKUP($F261,VegTypeParameters!$A:$H,8,FALSE)","v":{"$error":"#N/A"}},".",".",".","."]
[4,20,0,0,null,null,null,{"$f":"VLOOKUP(F262,VegTypeParameters!A:G,2,FALSE)","v":{"$error":"#N/A"}},{"$f":"VLOOKUP($F262,VegTypeParameters!$A:$G,5,FALSE)","v":{"$error":"#N/A"}},{"$f":"VLOOKUP($F262,VegTypeParameters!$A:$G,4,FALSE)","v":{"$error":"#N/A"}},{"$f":"G262+FieldBeeForm!$E$11","v":12},{"$error":"#N/A"},{"$f":"(VLOOKUP($F262,VegTypeParameters!A:G,6,FALSE))","v":{"$error":"#N/A"}},{"$f":"(VLOOKUP($F262,VegTypeParameters!A:G,7,FALSE))","v":{"$error":"#N/A"}},{"$error":"#N/A"},null,{"$error":"#N/A"},{"$error":"#N/A"},{"$error":"#N/A"},{"$error":"#N/A"},{"$error":"#N/A"},{"$f":"VLOOKUP($F262,VegTypeParameters!$A:$H,8,FALSE)","v":{"$error":"#N/A"}},".",".",".","."]
[4,21,0,0,null,null,null,{"$f":"VLOOKUP(F263,VegTypeParameters!A:G,2,FALSE)","v":{"$error":"#N/A"}},{"$f":"VLOOKUP($F263,VegTypeParameters!$A:$G,5,FALSE)","v":{"$error":"#N/A"}},{"$f":"VLOOKUP($F263,VegTypeParameters!$A:$G,4,FALSE)","v":{"$error":"#N/A"}},{"$f":"G263+FieldBeeForm!$E$11","v":12},{"$error":"#N/A"},{"$f":"(VLOOKUP($F263,VegTypeParameters!A:G,6,FALSE))","v":{"$error":"#N/A"}},{"$f":"(VLOOKUP($F263,VegTypeParameters!A:G,7,FALSE))","v":{"$error":"#N/A"}},{"$error":"#N/A"},null,{"$error":"#N/A"},{"$error":"#N/A"},{"$error":"#N/A"},{"$error":"#N/A"},{"$error":"#N/A"},{"$f":"VLOOKUP($F263,VegTypeParameters!$A:$H,8,FALSE)","v":{"$error":"#N/A"}},".",".",".","."]
[4,22,0,0,null,null,null,{"$f":"VLOOKUP(F264,VegTypeParameters!A:G,2,FALSE)","v":{"$error":"#N/A"}},{"$f":"VLOOKUP($F264,VegTypeParameters!$A:$G,5,FALSE)","v":{"$error":"#N/A"}},{"$f":"VLOOKUP($F264,VegTypeParameters!$A:$G,4,FALSE)","v":{"$error":"#N/A"}},{"$f":"G264+FieldBeeForm!$E$11","v":12},{"$error":"#N/A"},{"$f":"(VLOOKUP($F264,VegTypeParameters!A:G,6,FALSE))","v":{"$error":"#N/A"}},{"$f":"(VLOOKUP($F264,VegTypeParameters!A:G,7,FALSE))","v":{"$error":"#N/A"}},{"$error":"#N/A"},null,{"$error":"#N/A"},{"$error":"#N/A"},{"$error":"#N/A"},{"$error":"#N/A"},{"$error":"#N/A"},{"$f":"VLOOKUP($F264,VegTypeParameters!$A:$H,8,FALSE)","v":{"$error":"#N/A"}},".",".",".","."]
[4,23,0,0,null,null,null,{"$f":"VLOOKUP(F265,VegTypeParameters!A:G,2,FALSE)","v":{"$error":"#N/A"}},{"$f":"VLOOKUP($F265,VegTypeParameters!$A:$G,5,FALSE)","v":{"$error":"#N/A"}},{"$f":"VLOOKUP($F265,VegTypeParameters!$A:$G,4,FALSE)","v":{"$error":"#N/A"}},{"$f":"G265+FieldBeeForm!$E$11","v":12},{"$error":"#N/A"},{"$f":"(VLOOKUP($F265,VegTypeParameters!A:G,6,FALSE))","v":{"$error":"#N/A"}},{"$f":"(VLOOKUP($F265,VegTypeParameters!A:G,7,FALSE))","v":{"$error":"#N/A"}},{"$error":"#N/A"},null,{"$error":"#N/A"},{"$error":"#N/A"},{"$error":"#N/A"},{"$error":"#N/A"},{"$error":"#N/A"},{"$f":"VLOOKUP($F265,VegTypeParameters!$A:$H,8,FALSE)","v":{"$error":"#N/A"}},".",".",".","."]
[4,24,0,0,null,null,null,{"$f":"VLOOKUP(F266,VegTypeParameters!A:G,2,FALSE)","v":{"$error":"#N/A"}},{"$f":"VLOOKUP($F266,VegTypeParameters!$A:$G,5,FALSE)","v":{"$error":"#N/A"}},{"$f":"VLOOKUP($F266,VegTypeParameters!$A:$G,4,FALSE)","v":{"$error":"#N/A"}},{"$f":"G266+FieldBeeForm!$E$11","v":12},{"$error":"#N/A"},{"$f":"(VLOOKUP($F266,VegTypeParameters!A:G,6,FALSE))","v":{"$error":"#N/A"}},{"$f":"(VLOOKUP($F266,VegTypeParameters!A:G,7,FALSE))","v":{"$error":"#N/A"}},{"$error":"#N/A"},null,{"$error":"#N/A"},{"$error":"#N/A"},{"$error":"#N/A"},{"$error":"#N/A"},{"$error":"#N/A"},{"$f":"VLOOKUP($F266,VegTypeParameters!$A:$H,8,FALSE)","v":{"$error":"#N/A"}},".",".",".","."]
[4,25,0,0,null,null,null,{"$f":"VLOOKUP(F267,VegTypeParameters!A:G,2,FALSE)","v":{"$error":"#N/A"}},{"$f":"VLOOKUP($F267,VegTypeParameters!$A:$G,5,FALSE)","v":{"$error":"#N/A"}},{"$f":"VLOOKUP($F267,VegTypeParameters!$A:$G,4,FALSE)","v":{"$error":"#N/A"}},{"$f":"G267+FieldBeeForm!$E$11","v":12},{"$f":"IF(J267>0,J267*(1-EXP(-I267*K267/J267)), 0)","v":{"$error":"#N/A"}},{"$f":"(VLOOKUP($F267,VegTypeParameters!A:G,6,FALSE))","v":{"$error":"#N/A"}},{"$f":"(VLOOKUP($F267,VegTypeParameters!A:G,7,FALSE))","v":{"$error":"#N/A"}},{"$f":"IF(M267>0, (M267*(1-EXP(-N267*G267/M267)))*(M267*(1-EXP(-N267*G267/M267))),0)","v":{"$error":"#N/A"}},null,{"$f":"IF(O267>0, (D267*E267)/O267,0)","v":{"$error":"#N/A"}},{"$f":"IF(M267>0, (M267*(1-EXP(-N267*K267/M267)))*(M267*(1-EXP(-N267*K267/M267))), 0)","v":{"$error":"#N/A"}},{"$f":"IF(M267>0,(M267*(1-EXP(-N267*K267/M267)))*L267,0)","v":{"$error":"#N/A"}},{"$error":"#N/A"},{"$error":"#N/A"},{"$f":"VLOOKUP($F267,VegTypeParameters!$A:$H,8,FALSE)","v":{"$error":"#N/A"}},".",".",".","."]
[4,26,0,0,null,null,null,{"$f":"VLOOKUP(F268,VegTypeParameters!A:G,2,FALSE)","v":{"$error":"#N/A"}},{"$f":"VLOOKUP($F268,VegTypeParameters!$A:$G,5,FALSE)","v":{"$error":"#N/A"}},{"$f":"VLOOKUP($F268,VegTypeParameters!$A:$G,4,FALSE)","v":{"$error":"#N/A"}},{"$f":"G268+FieldBeeForm!$E$11","v":12},{"$f":"IF(J268>0,J268*(1-EXP(-I268*K268/J268)), 0)","v":{"$error":"#N/A"}},{"$f":"(VLOOKUP($F268,VegTypeParameters!A:G,6,FALSE))","v":{"$error":"#N/A"}},{"$f":"(VLOOKUP($F268,VegTypeParameters!A:G,7,FALSE))","v":{"$error":"#N/A"}},{"$f":"IF(M268>0, (M268*(1-EXP(-N268*G268/M268)))*(M268*(1-EXP(-N268*G268/M268))),0)","v":{"$error":"#N/A"}},null,{"$f":"IF(O268>0, (D268*E268)/O268,0)","v":{"$error":"#N/A"}},{"$f":"IF(M268>0, (M268*(1-EXP(-N268*K268/M268)))*(M268*(1-EXP(-N268*K268/M268))), 0)","v":{"$error":"#N/A"}},{"$f":"IF(M268>0,(M268*(1-EXP(-N268*K268/M268)))*L268,0)","v":{"$error":"#N/A"}},{"$error":"#N/A"},{"$error":"#N/A"},{"$f":"VLOOKUP($F268,VegTypeParameters!$A:$H,8,FALSE)","v":{"$error":"#N/A"}},".",".",".","."]
[4,27,0,0,null,null,null,{"$f":"VLOOKUP(F269,VegTypeParameters!A:G,2,FALSE)","v":{"$error":"#N/A"}},{"$f":"VLOOKUP($F269,VegTypeParameters!$A:$G,5,FALSE)","v":{"$error":"#N/A"}},{"$f":"VLOOKUP($F269,VegTypeParameters!$A:$G,4,FALSE)","v":{"$error":"#N/A"}},{"$f":"G269+FieldBeeForm!$E$11","v":12},{"$error":"#N/A"},{"$f":"(VLOOKUP($F269,VegTypeParameters!A:G,6,FALSE))","v":{"$error":"#N/A"}},{"$f":"(VLOOKUP($F269,VegTypeParameters!A:G,7,FALSE))","v":{"$error":"#N/A"}},{"$error":"#N/A"},null,{"$error":"#N/A"},{"$error":"#N/A"},{"$error":"#N/A"},{"$error":"#N/A"},{"$error":"#N/A"},{"$f":"VLOOKUP($F269,VegTypeParameters!$A:$H,8,FALSE)","v":{"$error":"#N/A"}},".",".",".","."]
[4,28,0,0,null,null,null,{"$f":"VLOOKUP(F270,VegTypeParameters!A:G,2,FALSE)","v":{"$error":"#N/A"}},{"$f":"VLOOKUP($F270,VegTypeParameters!$A:$G,5,FALSE)","v":{"$error":"#N/A"}},{"$f":"VLOOKUP($F270,VegTypeParameters!$A:$G,4,FALSE)","v":{"$error":"#N/A"}},{"$f":"G270+FieldBeeForm!$E$11","v":12},{"$error":"#N/A"},{"$f":"(VLOOKUP($F270,VegTypeParameters!A:G,6,FALSE))","v":{"$error":"#N/A"}},{"$f":"(VLOOKUP($F270,VegTypeParameters!A:G,7,FALSE))","v":{"$error":"#N/A"}},{"$error":"#N/A"},null,{"$error":"#N/A"},{"$error":"#N/A"},{"$error":"#N/A"},{"$error":"#N/A"},{"$error":"#N/A"},{"$f":"VLOOKUP($F270,VegTypeParameters!$A:$H,8,FALSE)","v":{"$error":"#N/A"}},".",".",".","."]
[4,29,0,0,null,null,null,{"$f":"VLOOKUP(F271,VegTypeParameters!A:G,2,FALSE)","v":{"$error":"#N/A"}},{"$f":"VLOOKUP($F271,VegTypeParameters!$A:$G,5,FALSE)","v":{"$error":"#N/A"}},{"$f":"VLOOKUP($F271,VegTypeParameters!$A:$G,4,FALSE)","v":{"$error":"#N/A"}},{"$f":"G271+FieldBeeForm!$E$11","v":12},{"$error":"#N/A"},{"$f":"(VLOOKUP($F271,VegTypeParameters!A:G,6,FALSE))","v":{"$error":"#N/A"}},{"$f":"(VLOOKUP($F271,VegTypeParameters!A:G,7,FALSE))","v":{"$error":"#N/A"}},{"$error":"#N/A"},null,{"$error":"#N/A"},{"$error":"#N/A"},{"$error":"#N/A"},{"$error":"#N/A"},{"$error":"#N/A"},{"$f":"VLOOKUP($F271,VegTypeParameters!$A:$H,8,FALSE)","v":{"$error":"#N/A"}},".",".",".","."]
[4,30,0,0,null,null,null,{"$f":"VLOOKUP(F272,VegTypeParameters!A:G,2,FALSE)","v":{"$error":"#N/A"}},{"$f":"VLOOKUP($F272,VegTypeParameters!$A:$G,5,FALSE)","v":{"$error":"#N/A"}},{"$f":"VLOOKUP($F272,VegTypeParameters!$A:$G,4,FALSE)","v":{"$error":"#N/A"}},{"$f":"G272+FieldBeeForm!$E$11","v":12},{"$error":"#N/A"},{"$f":"(VLOOKUP($F272,VegTypeParameters!A:G,6,FALSE))","v":{"$error":"#N/A"}},{"$f":"(VLOOKUP($F272,VegTypeParameters!A:G,7,FALSE))","v":{"$error":"#N/A"}},{"$error":"#N/A"},null,{"$error":"#N/A"},{"$error":"#N/A"},{"$error":"#N/A"},{"$error":"#N/A"},{"$error":"#N/A"},{"$f":"VLOOKUP($F272,VegTypeParameters!$A:$H,8,FALSE)","v":{"$error":"#N/A"}},".",".",".","."]
[4,31,0,0,null,null,null,{"$f":"VLOOKUP(F273,VegTypeParameters!A:G,2,FALSE)","v":{"$error":"#N/A"}},{"$f":"VLOOKUP($F273,VegTypeParameters!$A:$G,5,FALSE)","v":{"$error":"#N/A"}},{"$f":"VLOOKUP($F273,VegTypeParameters!$A:$G,4,FALSE)","v":{"$error":"#N/A"}},{"$f":"G273+FieldBeeForm!$E$11","v":12},{"$error":"#N/A"},{"$f":"(VLOOKUP($F273,VegTypeParameters!A:G,6,FALSE))","v":{"$error":"#N/A"}},{"$f":"(VLOOKUP($F273,VegTypeParameters!A:G,7,FALSE))","v":{"$error":"#N/A"}},{"$error":"#N/A"},null,{"$error":"#N/A"},{"$error":"#N/A"},{"$error":"#N/A"},{"$error":"#N/A"},{"$error":"#N/A"},{"$f":"VLOOKUP($F273,VegTypeParameters!$A:$H,8,FALSE)","v":{"$error":"#N/A"}},".",".",".","."]
[4,32,0,0,null,null,null,{"$f":"VLOOKUP(F274,VegTypeParameters!A:G,2,FALSE)","v":{"$error":"#N/A"}},{"$f":"VLOOKUP($F274,VegTypeParameters!$A:$G,5,FALSE)","v":{"$error":"#N/A"}},{"$f":"VLOOKUP($F274,VegTypeParameters!$A:$G,4,FALSE)","v":{"$error":"#N/A"}},{"$f":"G274+FieldBeeForm!$E$11","v":12},{"$error":"#N/A"},{"$f":"(VLOOKUP($F274,VegTypeParameters!A:G,6,FALSE))","v":{"$error":"#N/A"}},{"$f":"(VLOOKUP($F274,VegTypeParameters!A:G,7,FALSE))","v":{"$error":"#N/A"}},{"$error":"#N/A"},null,{"$error":"#N/A"},{"$error":"#N/A"},{"$error":"#N/A"},{"$error":"#N/A"},{"$error":"#N/A"},{"$f":"VLOOKUP($F274,VegTypeParameters!$A:$H,8,FALSE)","v":{"$error":"#N/A"}},".",".",".","."]
[4,33,0,0,null,null,null,{"$f":"VLOOKUP(F275,VegTypeParameters!A:G,2,FALSE)","v":{"$error":"#N/A"}},{"$f":"VLOOKUP($F275,VegTypeParameters!$A:$G,5,FALSE)","v":{"$error":"#N/A"}},{"$f":"VLOOKUP($F275,VegTypeParameters!$A:$G,4,FALSE)","v":{"$error":"#N/A"}},{"$f":"G275+FieldBeeForm!$E$11","v":12},{"$error":"#N/A"},{"$f":"(VLOOKUP($F275,VegTypeParameters!A:G,6,FALSE))","v":{"$error":"#N/A"}},{"$f":"(VLOOKUP($F275,VegTypeParameters!A:G,7,FALSE))","v":{"$error":"#N/A"}},{"$error":"#N/A"},null,{"$error":"#N/A"},{"$error":"#N/A"},{"$error":"#N/A"},{"$error":"#N/A"},{"$error":"#N/A"},{"$f":"VLOOKUP($F275,VegTypeParameters!$A:$H,8,FALSE)","v":{"$error":"#N/A"}},".",".",".","."]
[4,34,0,0,null,null,null,{"$f":"VLOOKUP(F276,VegTypeParameters!A:G,2,FALSE)","v":{"$error":"#N/A"}},{"$f":"VLOOKUP($F276,VegTypeParameters!$A:$G,5,FALSE)","v":{"$error":"#N/A"}},{"$f":"VLOOKUP($F276,VegTypeParameters!$A:$G,4,FALSE)","v":{"$error":"#N/A"}},{"$f":"G276+FieldBeeForm!$E$11","v":12},{"$error":"#N/A"},{"$f":"(VLOOKUP($F276,VegTypeParameters!A:G,6,FALSE))","v":{"$error":"#N/A"}},{"$f":"(VLOOKUP($F276,VegTypeParameters!A:G,7,FALSE))","v":{"$error":"#N/A"}},{"$error":"#N/A"},null,{"$error":"#N/A"},{"$error":"#N/A"},{"$error":"#N/A"},{"$error":"#N/A"},{"$error":"#N/A"},{"$f":"VLOOKUP($F276,VegTypeParameters!$A:$H,8,FALSE)","v":{"$error":"#N/A"}},".",".",".","."]
[4,35,0,0,null,null,null,{"$f":"VLOOKUP(F277,VegTypeParameters!A:G,2,FALSE)","v":{"$error":"#N/A"}},{"$f":"VLOOKUP($F277,VegTypeParameters!$A:$G,5,FALSE)","v":{"$error":"#N/A"}},{"$f":"VLOOKUP($F277,VegTypeParameters!$A:$G,4,FALSE)","v":{"$error":"#N/A"}},{"$f":"G277+FieldBeeForm!$E$11","v":12},{"$error":"#N/A"},{"$f":"(VLOOKUP($F277,VegTypeParameters!A:G,6,FALSE))","v":{"$error":"#N/A"}},{"$f":"(VLOOKUP($F277,VegTypeParameters!A:G,7,FALSE))","v":{"$error":"#N/A"}},{"$error":"#N/A"},null,{"$error":"#N/A"},{"$error":"#N/A"},{"$error":"#N/A"},{"$error":"#N/A"},{"$error":"#N/A"},{"$f":"VLOOKUP($F277,VegTypeParameters!$A:$H,8,FALSE)","v":{"$error":"#N/A"}},".",".",".","."]
[null,null,null,"Horizontal extent of pollinator plant cover (m2) per season",null,null,null,"Vertical extent of pollinator plant cover (m2) per season",null,null,null,"Number of different pollinator plant species per season"]
["Map Unit #","Vegetation Entry",null,"Spatial extent of Veg Type (m2)","Early","Mid","Late","Spatial extent of Veg Type (m2)","Early","Mid","Late","Early","Mid","Late"]
[{"$f":"A243","v":4},{"$f":"B243","v":1},null,{"$f":"+IF(ISNA(VLOOKUP(B280,B$243:D$277, 3, FALSE)),0,VLOOKUP(B280,B$243:D$277, 3, FALSE))","v":0},{"$f":"+IF(SUMIFS(T$243:T$277, B$243:B$277, $B280, V$243:V$277, \"*\"&\"Early\"&\"*\") <=$D280, SUMIFS(T$243:T$277, B$243:B$277, $B280, V$243:V$277, \"*\"&\"Early\"&\"*\"), $D280)","v":0},{"$f":"+IF(SUMIFS(T$243:T$277,B$243:B$277, $B280, V$243:V$277, \"*\"&\"Mid\"&\"*\") <=$D280, SUMIFS(T$243:T$277,B$243:B$277, $B280, V$243:V$277, \"*\"&\"Mid\"&\"*\"), $D280)","v":0},{"$f":"+IF(SUMIFS(T$243:T$277, B$243:B$277, $B280, $V$243:$V$277, \"*\"&\"Late\"&\"*\") <=$D280, SUMIFS(T$243:T$277,B$243:B$277, $B280,$V$243:$V$277, \"*\"&\"Late\"&\"*\"), $D280)","v":0},{"$f":"+IF(ISNA(VLOOKUP(B280,B$243:D$277, 3, FALSE)),0,VLOOKUP(B280,B$243:D$277, 3, FALSE))","v":0},{"$f":"+IF(SUMIFS($U$243:$U$277, $B$243:$B$277, $B280, $V$243:$V$277, \"*\"&\"Early\"&\"*\") <=$D280, SUMIFS($U$243:$U$277, $B$243:$B$277, $B280, $V$243:$V$277, \"*\"&\"Early\"&\"*\"), $D280)","v":0},{"$f":"+IF(SUMIFS($U$243:$U$277, $B$243:$B$277, $B280, $V$243:$V$277, \"*\"&\"Mid\"&\"*\") <=$D280, SUMIFS($U$243:$U$277, $B$243:$B$277, $B280, $V$243:$V$277, \"*\"&\"Mid\"&\"*\"), $D280)","v":0},{"$f":"+IF(SUMIFS($U$243:$U$277, $B$243:$B$277, $B280, $V$243:$V$277, \"*\"&\"Late\"&\"*\") <=$D280, SUMIFS($U$243:$U$277, $B$243:$B$277, $B280, $V$243:$V$277, \"*\"&\"Late\"&\"*\"), $D280)","v":0}," "]
[{"$f":"A244","v":4},2,null,{"$f":"+IF(ISNA(VLOOKUP(B281,B$243:D$277, 3, FALSE)),0,VLOOKUP(B281,B$243:D$277, 3, FALSE))","v":0},{"$f":"+IF(SUMIFS(T$243:T$277, B$243:B$277, $B281, V$243:V$277, \"*\"&\"Early\"&\"*\") <=$D281, SUMIFS(T$243:T$277, B$243:B$277, $B281, V$243:V$277, \"*\"&\"Early\"&\"*\"), $D281)","v":0},{"$f":"+IF(SUMIFS(T$243:T$277,B$243:B$277, $B281, V$243:V$277, \"*\"&\"Mid\"&\"*\") <=$D281, SUMIFS(T$243:T$277,B$243:B$277, $B281, V$243:V$277, \"*\"&\"Mid\"&\"*\"), $D281)","v":0},{"$f":"+IF(SUMIFS(T$243:T$277, B$243:B$277, $B281, $V$243:$V$277, \"*\"&\"Late\"&\"*\") <=$D281, SUMIFS(T$243:T$277,B$243:B$277, $B281,$V$243:$V$277, \"*\"&\"Late\"&\"*\"), $D281)","v":0},{"$f":"+IF(ISNA(VLOOKUP(B281,B$243:D$277, 3, FALSE)),0,VLOOKUP(B281,B$243:D$277, 3, FALSE))","v":0},{"$f":"+IF(SUMIFS($U$243:$U$277, $B$243:$B$277, $B281, $V$243:$V$277, \"*\"&\"Early\"&\"*\") <=$D281, SUMIFS($U$243:$U$277, $B$243:$B$277, $B281, $V$243:$V$277, \"*\"&\"Early\"&\"*\"), $D281)","v":0},{"$f":"+IF(SUMIFS($U$243:$U$277, $B$243:$B$277, $B281, $V$243:$V$277, \"*\"&\"Mid\"&\"*\") <=$D281, SUMIFS($U$243:$U$277, $B$243:$B$277, $B281, $V$243:$V$277, \"*\"&\"Mid\"&\"*\"), $D281)","v":0},{"$f":"+IF(SUMIFS($U$243:$U$277, $B$243:$B$277, $B281, $V$243:$V$277, \"*\"&\"Late\"&\"*\") <=$D281, SUMIFS($U$243:$U$277, $B$243:$B$277, $B281, $V$243:$V$277, \"*\"&\"Late\"&\"*\"), $D281)","v":0}," "]
[{"$f":"A245","v":4},3,null,0,0,0,0,0,0,0,0]
[{"$f":"A246","v":4},4,null,0,0,0,0,0,0,0,0]
[{"$f":"A247","v":4},5,null,0,0,0,0,0,0,0,0]
[{"$f":"A248","v":4},6,null,0,0,0,0,0,0,0,0]
[{"$f":"A249","v":4},7,null,0,0,0,0,0,0,0,0]
[{"$f":"A250","v":4},8,null,0,0,0,0,0,0,0,0]
[{"$f":"A251","v":4},9,null,0,0,0,0,0,0,0,0]
[{"$f":"A252","v":4},10,null,0,0,0,0,0,0,0,{"$f":"+IF(SUMIFS($U$243:$U$277, $B$243:$B$277, $B289, $V$243:$V$277, \"*\"&\"Late\"&\"*\") <=$D289, SUMIFS($U$243:$U$277, $B$243:$B$277, $B289, $V$243:$V$277, \"*\"&\"Late\"&\"*\"), $D289)","v":0}]
[{"$f":"A253","v":4},11,null,{"$f":"+IF(ISNA(VLOOKUP(B290,B$243:D$277, 3, FALSE)),0,VLOOKUP(B290,B$243:D$277, 3, FALSE))","v":0},{"$f":"+IF(SUMIFS(T$243:T$277, B$243:B$277, $B290, V$243:V$277, \"*\"&\"Early\"&\"*\") <=$D290, SUMIFS(T$243:T$277, B$243:B$277, $B290, V$243:V$277, \"*\"&\"Early\"&\"*\"), $D290)","v":0},{"$f":"+IF(SUMIFS(T$243:T$277,B$243:B$277, $B290, V$243:V$277, \"*\"&\"Mid\"&\"*\") <=$D290, SUMIFS(T$243:T$277,B$243:B$277, $B290, V$243:V$277, \"*\"&\"Mid\"&\"*\"), $D290)","v":0},{"$f":"+IF(SUMIFS(T$243:T$277, B$243:B$277, $B290, $V$243:$V$277, \"*\"&\"Late\"&\"*\") <=$D290, SUMIFS(T$243:T$277,B$243:B$277, $B290,$V$243:$V$277, \"*\"&\"Late\"&\"*\"), $D290)","v":0},{"$f":"+IF(ISNA(VLOOKUP(B290,B$243:D$277, 3, FALSE)),0,VLOOKUP(B290,B$243:D$277, 3, FALSE))","v":0},0,0,{"$f":"+IF(SUMIFS($U$243:$U$277, $B$243:$B$277, $B290, $V$243:$V$277, \"*\"&\"Late\"&\"*\") <=$D290, SUMIFS($U$243:$U$277, $B$243:$B$277, $B290, $V$243:$V$277, \"*\"&\"Late\"&\"*\"), $D290)","v":0}]
[{"$f":"A254","v":4},12,null,0,0,0,0,0,0,0,0]
[{"$f":"A255","v":4},13,null,0,0,0,0,0,0,0,0]
[{"$f":"A256","v":4},14,null,0,0,0,0,0,0,0,0]
[{"$f":"A257","v":4},15,null,0,0,0,0,0,0,0,0]
[{"$f":"A258","v":4},16,null,0,0,0,0,0,0,0,0]
[{"$f":"A259","v":4},17,null,0,0,0,0,0,0,0,0]
[{"$f":"A260","v":4},18,null,0,0,0,0,0,0,0,0]
[{"$f":"A261","v":4},19,null,0,0,0,0,0,0,0,0]
[{"$f":"A262","v":4},20,null,0,0,0,0,0,0,0,0]
[{"$f":"A263","v":4},21,null,0,0,0,0,0,0,0,0]
[{"$f":"A264","v":4},22,null,0,0,0,0,0,0,0,0]
[{"$f":"A265","v":4},23,null,0,0,0,0,0,0,0,0]
[{"$f":"A266","v":4},24,null,0,0,0,0,0,0,0,0]
[{"$f":"A267","v":4},25,null,0,0,0,0,0,0,0,0]
[{"$f":"A268","v":4},26,null,0,0,0,0,0,0,0,0]
[{"$f":"A269","v":4},27,null,0,0,0,0,0,0,0,0]
[{"$f":"A270","v":4},28,null,0,0,0,0,0,0,0,0]
[{"$f":"A271","v":4},29,null,0,0,0,0,0,0,0,0]
[{"$f":"A272","v":4},30,null,0,0,0,0,0,0,0,0]
[{"$f":"A273","v":4},31,null,0,0,0,0,0,0,0,0]
[{"$f":"A274","v":4},32,null,0,0,0,0,0,0,0,0]
[{"$f":"A275","v":4},33,null,0,0,0,0,0,0,0,0]
[{"$f":"A276","v":4},34,null,0,0,0,0,0,0,0,0]
[{"$f":"A277","v":4},35,null,0,0,0,0,0,0,0,0]
[{"$f":"A243","v":4},"Total",null,{"$f":"+SUM(D280:D314)","v":0},{"$f":"+SUM(E280:E314)","v":0},0,0,0,0,0,0,{"$f":"+X242","v":7},{"$f":"+Y242","v":10},{"$f":"+Z242","v":7}]
[null," ",null,{"$f":"D315","v":0},"Map Unit Size in Acres",null,{"$f":"FieldBeeForm!H14","v":20000},"Value entered in FieldBeeForm (Should be same as cell C216)"]
[]
["Enter only in yellow cells. Leave rest untouched.",null,null,null,null,null,"Enter the current year age in column G for each vegetation type. This age will be added to the assessment year (input on Field data form) to determine time series age in column K. If you are interested in just the current effects, enter a '0' in cell E11 of the Field data form."]
["Map Unit","Vegetation Entry","Map Unit Size","Spatial extent of Veg Type","Existing Cover Class for VegType","Species/ VegType","Existing Age of Average Plant \n(for S enter 1, for Sa enter 2, for P enter 3, for M enter 5, for D enter 10)","Species/Vegetation Type Descriptions","Ht Rate","Ht max","Future Age","Future Height","Canopy Width Max (m)","Canopy Width Rate","Existing Age canopy area per plant",null,"Estimated # Individuals","Future Horizontal Surface Area per plant (width x width)","Future Vertical Surface Area per plant (width x height)","Horizontal Surface Area Across Map Unit","Vertical Surface Area Across Map Unit","Season(s)","Season(s) (.)","Early","Mid","Late"]
["#","#"," sq ft","m2","%","code","yrs",null,"m/yr","m","yrs","m","m","m/yr","m2",null,"number","m2","m2","m2","m2",null,null,{"$f":"SUM(IF(FREQUENCY(MATCH(X321:X355, X321:X355,0),MATCH(X321:X355, X321:X355,0))>0,1))-1","v":7},{"$f":"SUM(IF(FREQUENCY(MATCH(Y321:Y355, Y321:Y355,0),MATCH(Y321:Y355, Y321:Y355,0))>0,1))-1","v":10},{"$f":"SUM(IF(FREQUENCY(MATCH(Z321:Z355, Z321:Z355,0),MATCH(Z321:Z355, Z321:Z355,0))>0,1))-1","v":7}]
[5,1,null,{"$f":"(0.092903*C321)*E321","v":0},0.06,1600,5,{"$f":"VLOOKUP(F321,VegTypeParameters!A:G,2,FALSE)","v":"Atriplex"},{"$f":"VLOOKUP($F321,VegTypeParameters!$A:$G,5,FALSE)","v":3.2962962962962963},{"$f":"VLOOKUP($F321,VegTypeParameters!$A:$G,4,FALSE)","v":3},{"$f":"G321+FieldBeeForm!$E$11","v":17},{"$f":"IF(J321>0,J321*(1-EXP(-I321*K321/J321)), 0)","v":2.9999999768298276},{"$f":"(VLOOKUP($F321,VegTypeParameters!A:G,6,FALSE))","v":5},{"$f":"(VLOOKUP($F321,VegTypeParameters!A:G,7,FALSE))","v":7.1111111111111107},{"$f":"IF(M321>0, (M321*(1-EXP(-N321*G321/M321)))*(M321*(1-EXP(-N321*G321/M321))),0)","v":24.959217254150069},null,{"$f":"IF(O321>0, (D321*E321)/O321,0)","v":0},{"$f":"IF(M321>0, (M321*(1-EXP(-N321*K321/M321)))*(M321*(1-EXP(-N321*K321/M321))), 0)","v":24.99999999841986},{"$f":"IF(M321>0,(M321*(1-EXP(-N321*K321/M321)))*L321,0)","v":14.999999883675097},{"$f":"R321*Q321","v":0},{"$f":"S321*Q321","v":0},{"$f":"VLOOKUP($F321,VegTypeParameters!$A:$H,8,FALSE)","v":"Mid/Late"},{"$f":"+IF(ISNA(V321), \".\",  V321)","v":"Mid/Late"},{"$f":"IF($W321=\"Early/Mid\",$H321,IF($W321=\"Early\", $H321, IF($W321=\"Early/Mid/Late\", $H321,\".\")))","v":"."},{"$f":"IF($W321=\"Early/Mid\",$H321,IF($W321=\"Mid\", $H321, IF($W321=\"Mid/Late\", $H321, IF($W321=\"Early/Mid/Late\", $H321,\".\"))))","v":"Atriplex"},{"$f":"IF($W321=\"Mid/Late\",$H321,IF($W321=\"Late\", $H321, IF($W321=\"Early/Mid/Late\", $H321,\".\")))","v":"Atriplex"}]
[5,2,{"$f":"C$321","v":0},{"$f":"(0.092903*C322)*E322","v":0},0.03,4200,3,{"$f":"VLOOKUP(F322,VegTypeParameters!A:G,2,FALSE)","v":"Helianthus"},{"$f":"VLOOKUP($F322,VegTypeParameters!$A:$G,5,FALSE)","v":6.5},{"$f":"VLOOKUP($F322,VegTypeParameters!$A:$G,4,FALSE)","v":2.5},{"$f":"G322+FieldBeeForm!$E$11","v":15},2.5,{"$f":"(VLOOKUP($F322,VegTypeParameters!A:G,6,FALSE))","v":0.75},{"$f":"(VLOOKUP($F322,VegTypeParameters!A:G,7,FALSE))","v":1.25},0.55494534708652032,null,0,0.56249999998437616,1.8749999999739604,0,0,{"$f":"VLOOKUP($F322,VegTypeParameters!$A:$H,8,FALSE)","v":"Mid/Late"},{"$f":"+IF(ISNA(V322), \".\",  V322)","v":"Mid/Late"},{"$f":"IF($W322=\"Early/Mid\",$H322,IF($W322=\"Early\", $H322, IF($W322=\"Early/Mid/Late\", $H322,\".\")))","v":"."},{"$f":"IF($W322=\"Early/Mid\",$H322,IF($W322=\"Mid\", $H322, IF($W322=\"Mid/Late\", $H322, IF($W322=\"Early/Mid/Late\", $H322,\".\"))))","v":"Helianthus"},{"$f":"IF($W322=\"Mid/Late\",$H322,IF($W322=\"Late\", $H322, IF($W322=\"Early/Mid/Late\", $H322,\".\")))","v":"Helianthus"}]
[5,3,{"$f":"C$321","v":0},0,0.08,4000,3,{"$f":"VLOOKUP(F323,VegTypeParameters!A:G,2,FALSE)","v":"Grindelia"},{"$f":"VLOOKUP($F323,VegTypeParameters!$A:$G,5,FALSE)","v":1.6666666666666667},{"$f":"VLOOKUP($F323,VegTypeParameters!$A:$G,4,FALSE)","v":2.5},{"$f":"G323+FieldBeeForm!$E$11","v":15},2.4998865001755939,{"$f":"(VLOOKUP($F323,VegTypeParameters!A:G,6,FALSE))","v":2},{"$f":"(VLOOKUP($F323,VegTypeParameters!A:G,7,FALSE))","v":1.3333333333333333},2.9905802896620353,null,0,3.9996368088065144,4.9995460110081433,0,0,{"$f":"VLOOKUP($F323,VegTypeParameters!$A:$H,8,FALSE)","v":"Mid/Late"},"Mid/Late",".","Grindelia","Grindelia"]
[5,4,0,0,0.08,7000,3,{"$f":"VLOOKUP(F324,VegTypeParameters!A:G,2,FALSE)","v":"Salix (shrub)"},{"$f":"VLOOKUP($F324,VegTypeParameters!$A:$G,5,FALSE)","v":0.73},{"$f":"VLOOKUP($F324,VegTypeParameters!$A:$G,4,FALSE)","v":3.5},{"$f":"G324+FieldBeeForm!$E$11","v":15},3.3467689644197414,{"$f":"(VLOOKUP($F324,VegTypeParameters!A:G,6,FALSE))","v":2.5},{"$f":"(VLOOKUP($F324,VegTypeParameters!A:G,7,FALSE))","v":0.55000000000000004},1.4589539561403246,null,0,5.7974627077191743,8.0583238111294335,0,0,{"$f":"VLOOKUP($F324,VegTypeParameters!$A:$H,8,FALSE)","v":"Early"},"Early","Salix (shrub)",".","."]
[5,5,0,0,0.08,8400,5,{"$f":"VLOOKUP(F325,VegTypeParameters!A:G,2,FALSE)","v":"Weeds, non-invasive and not beneficial to pollinators"},{"$f":"VLOOKUP($F325,VegTypeParameters!$A:$G,5,FALSE)","v":0},{"$f":"VLOOKUP($F325,VegTypeParameters!$A:$G,4,FALSE)","v":0},{"$f":"G325+FieldBeeForm!$E$11","v":17},0,{"$f":"(VLOOKUP($F325,VegTypeParameters!A:G,6,FALSE))","v":0},{"$f":"(VLOOKUP($F325,VegTypeParameters!A:G,7,FALSE))","v":0},0,null,0,0,0,0,0,{"$f":"VLOOKUP($F325,VegTypeParameters!$A:$H,8,FALSE)","v":"Never"},"Never",".",".","."]
[5,6,0,0,0.08,5300,3,{"$f":"VLOOKUP(F326,VegTypeParameters!A:G,2,FALSE)","v":"Medicago "},{"$f":"VLOOKUP($F326,VegTypeParameters!$A:$G,5,FALSE)","v":0.5},{"$f":"VLOOKUP($F326,VegTypeParameters!$A:$G,4,FALSE)","v":0.5},{"$f":"G326+FieldBeeForm!$E$11","v":15},0.49999984704883976,{"$f":"(VLOOKUP($F326,VegTypeParameters!A:G,6,FALSE))","v":0.7},{"$f":"(VLOOKUP($F326,VegTypeParameters!A:G,7,FALSE))","v":0.7},0.44242326156605982,null,0,0.48999970021577172,0.34999978586840841,0,0,{"$f":"VLOOKUP($F326,VegTypeParameters!$A:$H,8,FALSE)","v":"Mid/Late"},"Mid/Late",".","Medicago ","Medicago "]
[5,7,0,0,0.08,1600,3,{"$f":"VLOOKUP(F327,VegTypeParameters!A:G,2,FALSE)","v":"Atriplex"},{"$f":"VLOOKUP($F327,VegTypeParameters!$A:$G,5,FALSE)","v":3.2962962962962963},{"$f":"VLOOKUP($F327,VegTypeParameters!$A:$G,4,FALSE)","v":3},{"$f":"G327+FieldBeeForm!$E$11","v":15},2.999999791404568,{"$f":"(VLOOKUP($F327,VegTypeParameters!A:G,6,FALSE))","v":5},{"$f":"(VLOOKUP($F327,VegTypeParameters!A:G,7,FALSE))","v":7.1111111111111107},24.303496604054391,null,0,24.999999972834292,14.999998948873127,0,0,{"$f":"VLOOKUP($F327,VegTypeParameters!$A:$H,8,FALSE)","v":"Mid/Late"},"Mid/Late",".","Atriplex","Atriplex"]
[5,8,0,0,0.03,7500,3,{"$f":"VLOOKUP(F328,VegTypeParameters!A:G,2,FALSE)","v":"Scrophularia"},{"$f":"VLOOKUP($F328,VegTypeParameters!$A:$G,5,FALSE)","v":1.2},{"$f":"VLOOKUP($F328,VegTypeParameters!$A:$G,4,FALSE)","v":1.2},{"$f":"G328+FieldBeeForm!$E$11","v":15},1.1999996329172153,{"$f":"(VLOOKUP($F328,VegTypeParameters!A:G,6,FALSE))","v":0.3},{"$f":"(VLOOKUP($F328,VegTypeParameters!A:G,7,FALSE))","v":0.3},8.1261415389684455E-2,null,0,8.9999944937590726E-2,0.3599997797503629,0,0,{"$f":"VLOOKUP($F328,VegTypeParameters!$A:$H,8,FALSE)","v":"Early/Mid"},"Early/Mid","Scrophularia","Scrophularia","."]
[5,9,0,0,0.03,3500,3,{"$f":"VLOOKUP(F329,VegTypeParameters!A:G,2,FALSE)","v":"Ficus carica"},{"$f":"VLOOKUP($F329,VegTypeParameters!$A:$G,5,FALSE)","v":0},{"$f":"VLOOKUP($F329,VegTypeParameters!$A:$G,4,FALSE)","v":0},{"$f":"G329+FieldBeeForm!$E$11","v":15},0,{"$f":"(VLOOKUP($F329,VegTypeParameters!A:G,6,FALSE))","v":0},{"$f":"(VLOOKUP($F329,VegTypeParameters!A:G,7,FALSE))","v":0},0,null,0,0,0,0,0,{"$f":"VLOOKUP($F329,VegTypeParameters!$A:$H,8,FALSE)","v":"Never"},"Never",".",".","."]
[5,10,0,0,0.03,6200,3,{"$f":"VLOOKUP(F330,VegTypeParameters!A:G,2,FALSE)","v":"Other late blooming native plants beneficial to pollinators"},{"$f":"VLOOKUP($F330,VegTypeParameters!$A:$G,5,FALSE)","v":0.25},{"$f":"VLOOKUP($F330,VegTypeParameters!$A:$G,4,FALSE)","v":1},{"$f":"G330+FieldBeeForm!$E$11","v":15},0.97648225414399092,{"$f":"(VLOOKUP($F330,VegTypeParameters!A:G,6,FALSE))","v":0.5},{"$f":"(VLOOKUP($F330,VegTypeParameters!A:G,7,FALSE))","v":0.25},0.15088168701775109,null,0,0.24972353429050623,0.48797108853574861,0,0,{"$f":"VLOOKUP($F330,VegTypeParameters!$A:$H,8,FALSE)","v":"Late"},"Late",".",".","Other late blooming native plants beneficial to pollinators"]
[5,11,0,0,0.03,2500,3,{"$f":"VLOOKUP(F331,VegTypeParameters!A:G,2,FALSE)","v":"Clarkia"},{"$f":"VLOOKUP($F331,VegTypeParameters!$A:$G,5,FALSE)","v":0.4},{"$f":"VLOOKUP($F331,VegTypeParameters!$A:$G,4,FALSE)","v":0.4},{"$f":"G331+FieldBeeForm!$E$11","v":15},0.39999987763907185,{"$f":"(VLOOKUP($F331,VegTypeParameters!A:G,6,FALSE))","v":0.1},{"$f":"(VLOOKUP($F331,VegTypeParameters!A:G,7,FALSE))","v":0.1},9.029046154409387E-3,null,0,9.9999938819545289E-3,3.9999975527818116E-2,0,0,{"$f":"VLOOKUP($F331,VegTypeParameters!$A:$H,8,FALSE)","v":"Early/Mid"},"Early/Mid","Clarkia","Clarkia","."]
[5,12,0,0,0.08,5000,3,{"$f":"VLOOKUP(F332,VegTypeParameters!A:G,2,FALSE)","v":"Lupinus spp."},{"$f":"VLOOKUP($F332,VegTypeParameters!$A:$G,5,FALSE)","v":0.98000000000000009},{"$f":"VLOOKUP($F332,VegTypeParameters!$A:$G,4,FALSE)","v":3},{"$f":"G332+FieldBeeForm!$E$11","v":15},2.9776602507872267,{"$f":"(VLOOKUP($F332,VegTypeParameters!A:G,6,FALSE))","v":3},{"$f":"(VLOOKUP($F332,VegTypeParameters!A:G,7,FALSE))","v":1.08},3.925206627733659,null,0,8.9188851385636738,8.8926342217348378,0,0,{"$f":"VLOOKUP($F332,VegTypeParameters!$A:$H,8,FALSE)","v":"Early/Mid/Late"},"Early/Mid/Late","Lupinus spp.","Lupinus spp.","Lupinus spp."]
[5,13,0,0,0.08,6000,3,{"$f":"VLOOKUP(F333,VegTypeParameters!A:G,2,FALSE)","v":"Orchard"},{"$f":"VLOOKUP($F333,VegTypeParameters!$A:$G,5,FALSE)","v":0.5},{"$f":"VLOOKUP($F333,VegTypeParameters!$A:$G,4,FALSE)","v":10},{"$f":"G333+FieldBeeForm!$E$11","v":15},5.2763344725898529,{"$f":"(VLOOKUP($F333,VegTypeParameters!A:G,6,FALSE))","v":6},{"$f":"(VLOOKUP($F333,VegTypeParameters!A:G,7,FALSE))","v":0.5},1.7614473685136525,null,0,18.326714576526665,22.58783601812447,0,0,{"$f":"VLOOKUP($F333,VegTypeParameters!$A:$H,8,FALSE)","v":"Early"},"Early","Orchard",".","."]
[5,14,0,0,0.03,3300,5,{"$f":"VLOOKUP(F334,VegTypeParameters!A:G,2,FALSE)","v":"Eschscholzia"},{"$f":"VLOOKUP($F334,VegTypeParameters!$A:$G,5,FALSE)","v":0.6},{"$f":"VLOOKUP($F334,VegTypeParameters!$A:$G,4,FALSE)","v":0.3},{"$f":"G334+FieldBeeForm!$E$11","v":17},0.29999999999999949,{"$f":"(VLOOKUP($F334,VegTypeParameters!A:G,6,FALSE))","v":0.15},{"$f":"(VLOOKUP($F334,VegTypeParameters!A:G,7,FALSE))","v":0.3},2.2497957049536645E-2,null,0,2.2499999999999923E-2,4.4999999999999846E-2,0,0,{"$f":"VLOOKUP($F334,VegTypeParameters!$A:$H,8,FALSE)","v":"Early/Mid"},"Early/Mid","Eschscholzia","Eschscholzia","."]
[5,15,0,0,0.03,5600,3,{"$f":"VLOOKUP(F335,VegTypeParameters!A:G,2,FALSE)","v":"Native forbs and graminoids not beneficial to pollinators"},{"$f":"VLOOKUP($F335,VegTypeParameters!$A:$G,5,FALSE)","v":0},{"$f":"VLOOKUP($F335,VegTypeParameters!$A:$G,4,FALSE)","v":0},{"$f":"G335+FieldBeeForm!$E$11","v":15},{"$f":"IF(J335>0,J335*(1-EXP(-I335*K335/J335)), 0)","v":0},{"$f":"(VLOOKUP($F335,VegTypeParameters!A:G,6,FALSE))","v":0},{"$f":"(VLOOKUP($F335,VegTypeParameters!A:G,7,FALSE))","v":0},{"$f":"IF(M335>0, (M335*(1-EXP(-N335*G335/M335)))*(M335*(1-EXP(-N335*G335/M335))),0)","v":0},null,{"$f":"IF(O335>0, (D335*E335)/O335,0)","v":0},{"$f":"IF(M335>0, (M335*(1-EXP(-N335*K335/M335)))*(M335*(1-EXP(-N335*K335/M335))), 0)","v":0},{"$f":"IF(M335>0,(M335*(1-EXP(-N335*K335/M335)))*L335,0)","v":0},0,0,{"$f":"VLOOKUP($F335,VegTypeParameters!$A:$H,8,FALSE)","v":"Never"},"Never",".",".","."]
[5,16,0,0,0.08,3800,3,{"$f":"VLOOKUP(F336,VegTypeParameters!A:G,2,FALSE)","v":"Gilia"},{"$f":"VLOOKUP($F336,VegTypeParameters!$A:$G,5,FALSE)","v":0.6},{"$f":"VLOOKUP($F336,VegTypeParameters!$A:$G,4,FALSE)","v":0.3},{"$f":"G336+FieldBeeForm!$E$11","v":15},{"$f":"IF(J336>0,J336*(1-EXP(-I336*K336/J336)), 0)","v":0.2999999999999719},{"$f":"(VLOOKUP($F336,VegTypeParameters!A:G,6,FALSE))","v":0.15},{"$f":"(VLOOKUP($F336,VegTypeParameters!A:G,7,FALSE))","v":0.3},{"$f":"IF(M336>0, (M336*(1-EXP(-N336*G336/M336)))*(M336*(1-EXP(-N336*G336/M336))),0)","v":2.2388594396827964E-2},null,{"$f":"IF(O336>0, (D336*E336)/O336,0)","v":0},{"$f":"IF(M336>0, (M336*(1-EXP(-N336*K336/M336)))*(M336*(1-EXP(-N336*K336/M336))), 0)","v":2.2499999999995784E-2},{"$f":"IF(M336>0,(M336*(1-EXP(-N336*K336/M336)))*L336,0)","v":4.4999999999991568E-2},0,0,{"$f":"VLOOKUP($F336,VegTypeParameters!$A:$H,8,FALSE)","v":"Mid"},"Mid",".","Gilia","."]
[5,17,0,0,0.08,1500,3,{"$f":"VLOOKUP(F337,VegTypeParameters!A:G,2,FALSE)","v":"Asclepias"},{"$f":"VLOOKUP($F337,VegTypeParameters!$A:$G,5,FALSE)","v":0.8},{"$f":"VLOOKUP($F337,VegTypeParameters!$A:$G,4,FALSE)","v":0.8},{"$f":"G337+FieldBeeForm!$E$11","v":15},0.79999975527814371,{"$f":"(VLOOKUP($F337,VegTypeParameters!A:G,6,FALSE))","v":0.2},{"$f":"(VLOOKUP($F337,VegTypeParameters!A:G,7,FALSE))","v":0.2},3.6116184617637548E-2,null,0,3.9999975527818116E-2,0.15999990211127246,0,0,{"$f":"VLOOKUP($F337,VegTypeParameters!$A:$H,8,FALSE)","v":"Early/Mid/Late"},"Early/Mid/Late","Asclepias","Asclepias","Asclepias"]
[5,18,0,0,5.0000000000000001E-3,1600,1,{"$f":"VLOOKUP(F338,VegTypeParameters!A:G,2,FALSE)","v":"Atriplex"},{"$f":"VLOOKUP($F338,VegTypeParameters!$A:$G,5,FALSE)","v":3.2962962962962963},{"$f":"VLOOKUP($F338,VegTypeParameters!$A:$G,4,FALSE)","v":3},{"$f":"G338+FieldBeeForm!$E$11","v":13},2.9999981220660135,{"$f":"(VLOOKUP($F338,VegTypeParameters!A:G,6,FALSE))","v":5},{"$f":"(VLOOKUP($F338,VegTypeParameters!A:G,7,FALSE))","v":7.1111111111111107},14.395290762184326,null,0,24.999999532966985,14.999990470220251,0,0,{"$f":"VLOOKUP($F338,VegTypeParameters!$A:$H,8,FALSE)","v":"Mid/Late"},"Mid/Late",".","Atriplex","Atriplex"]
[5,19,0,0,null,null,null,{"$f":"VLOOKUP(F339,VegTypeParameters!A:G,2,FALSE)","v":{"$error":"#N/A"}},{"$f":"VLOOKUP($F339,VegTypeParameters!$A:$G,5,FALSE)","v":{"$error":"#N/A"}},{"$f":"VLOOKUP($F339,VegTypeParameters!$A:$G,4,FALSE)","v":{"$error":"#N/A"}},{"$f":"G339+FieldBeeForm!$E$11","v":12},{"$error":"#N/A"},{"$f":"(VLOOKUP($F339,VegTypeParameters!A:G,6,FALSE))","v":{"$error":"#N/A"}},{"$f":"(VLOOKUP($F339,VegTypeParameters!A:G,7,FALSE))","v":{"$error":"#N/A"}},{"$error":"#N/A"},null,{"$error":"#N/A"},{"$error":"#N/A"},{"$error":"#N/A"},{"$error":"#N/A"},{"$error":"#N/A"},{"$f":"VLOOKUP($F339,VegTypeParameters!$A:$H,8,FALSE)","v":{"$error":"#N/A"}},".",".",".","."]
[5,20,0,0,null,null,null,{"$f":"VLOOKUP(F340,VegTypeParameters!A:G,2,FALSE)","v":{"$error":"#N/A"}},{"$f":"VLOOKUP($F340,VegTypeParameters!$A:$G,5,FALSE)","v":{"$error":"#N/A"}},{"$f":"VLOOKUP($F340,VegTypeParameters!$A:$G,4,FALSE)","v":{"$error":"#N/A"}},{"$f":"G340+FieldBeeForm!$E$11","v":12},{"$error":"#N/A"},{"$f":"(VLOOKUP($F340,VegTypeParameters!A:G,6,FALSE))","v":{"$error":"#N/A"}},{"$f":"(VLOOKUP($F340,VegTypeParameters!A:G,7,FALSE))","v":{"$error":"#N/A"}},{"$error":"#N/A"},null,{"$error":"#N/A"},{"$error":"#N/A"},{"$error":"#N/A"},{"$error":"#N/A"},{"$error":"#N/A"},{"$f":"VLOOKUP($F340,VegTypeParameters!$A:$H,8,FALSE)","v":{"$error":"#N/A"}},".",".",".","."]
[5,21,0,0,null,null,null,{"$f":"VLOOKUP(F341,VegTypeParameters!A:G,2,FALSE)","v":{"$error":"#N/A"}},{"$f":"VLOOKUP($F341,VegTypeParameters!$A:$G,5,FALSE)","v":{"$error":"#N/A"}},{"$f":"VLOOKUP($F341,VegTypeParameters!$A:$G,4,FALSE)","v":{"$error":"#N/A"}},{"$f":"G341+FieldBeeForm!$E$11","v":12},{"$error":"#N/A"},{"$f":"(VLOOKUP($F341,VegTypeParameters!A:G,6,FALSE))","v":{"$error":"#N/A"}},{"$f":"(VLOOKUP($F341,VegTypeParameters!A:G,7,FALSE))","v":{"$error":"#N/A"}},{"$error":"#N/A"},null,{"$error":"#N/A"},{"$error":"#N/A"},{"$error":"#N/A"},{"$error":"#N/A"},{"$error":"#N/A"},{"$f":"VLOOKUP($F341,VegTypeParameters!$A:$H,8,FALSE)","v":{"$error":"#N/A"}},".",".",".","."]
[5,22,0,0,null,null,null,{"$f":"VLOOKUP(F342,VegTypeParameters!A:G,2,FALSE)","v":{"$error":"#N/A"}},{"$f":"VLOOKUP($F342,VegTypeParameters!$A:$G,5,FALSE)","v":{"$error":"#N/A"}},{"$f":"VLOOKUP($F342,VegTypeParameters!$A:$G,4,FALSE)","v":{"$error":"#N/A"}},{"$f":"G342+FieldBeeForm!$E$11","v":12},{"$error":"#N/A"},{"$f":"(VLOOKUP($F342,VegTypeParameters!A:G,6,FALSE))","v":{"$error":"#N/A"}},{"$f":"(VLOOKUP($F342,VegTypeParameters!A:G,7,FALSE))","v":{"$error":"#N/A"}},{"$error":"#N/A"},null,{"$error":"#N/A"},{"$error":"#N/A"},{"$error":"#N/A"},{"$error":"#N/A"},{"$error":"#N/A"},{"$f":"VLOOKUP($F342,VegTypeParameters!$A:$H,8,FALSE)","v":{"$error":"#N/A"}},".",".",".","."]
[5,23,0,0,null,null,null,{"$f":"VLOOKUP(F343,VegTypeParameters!A:G,2,FALSE)","v":{"$error":"#N/A"}},{"$f":"VLOOKUP($F343,VegTypeParameters!$A:$G,5,FALSE)","v":{"$error":"#N/A"}},{"$f":"VLOOKUP($F343,VegTypeParameters!$A:$G,4,FALSE)","v":{"$error":"#N/A"}},{"$f":"G343+FieldBeeForm!$E$11","v":12},{"$error":"#N/A"},{"$f":"(VLOOKUP($F343,VegTypeParameters!A:G,6,FALSE))","v":{"$error":"#N/A"}},{"$f":"(VLOOKUP($F343,VegTypeParameters!A:G,7,FALSE))","v":{"$error":"#N/A"}},{"$error":"#N/A"},null,{"$error":"#N/A"},{"$error":"#N/A"},{"$error":"#N/A"},{"$error":"#N/A"},{"$error":"#N/A"},{"$f":"VLOOKUP($F343,VegTypeParameters!$A:$H,8,FALSE)","v":{"$error":"#N/A"}},".",".",".","."]
[5,24,0,0,null,null,null,{"$f":"VLOOKUP(F344,VegTypeParameters!A:G,2,FALSE)","v":{"$error":"#N/A"}},{"$f":"VLOOKUP($F344,VegTypeParameters!$A:$G,5,FALSE)","v":{"$error":"#N/A"}},{"$f":"VLOOKUP($F344,VegTypeParameters!$A:$G,4,FALSE)","v":{"$error":"#N/A"}},{"$f":"G344+FieldBeeForm!$E$11","v":12},{"$error":"#N/A"},{"$f":"(VLOOKUP($F344,VegTypeParameters!A:G,6,FALSE))","v":{"$error":"#N/A"}},{"$f":"(VLOOKUP($F344,VegTypeParameters!A:G,7,FALSE))","v":{"$error":"#N/A"}},{"$error":"#N/A"},null,{"$error":"#N/A"},{"$error":"#N/A"},{"$error":"#N/A"},{"$error":"#N/A"},{"$error":"#N/A"},{"$f":"VLOOKUP($F344,VegTypeParameters!$A:$H,8,FALSE)","v":{"$error":"#N/A"}},".",".",".","."]
[5,25,0,0,null,null,null,{"$f":"VLOOKUP(F345,VegTypeParameters!A:G,2,FALSE)","v":{"$error":"#N/A"}},{"$f":"VLOOKUP($F345,VegTypeParameters!$A:$G,5,FALSE)","v":{"$error":"#N/A"}},{"$f":"VLOOKUP($F345,VegTypeParameters!$A:$G,4,FALSE)","v":{"$error":"#N/A"}},{"$f":"G345+FieldBeeForm!$E$11","v":12},{"$f":"IF(J345>0,J345*(1-EXP(-I345*K345/J345)), 0)","v":{"$error":"#N/A"}},{"$f":"(VLOOKUP($F345,VegTypeParameters!A:G,6,FALSE))","v":{"$error":"#N/A"}},{"$f":"(VLOOKUP($F345,VegTypeParameters!A:G,7,FALSE))","v":{"$error":"#N/A"}},{"$f":"IF(M345>0, (M345*(1-EXP(-N345*G345/M345)))*(M345*(1-EXP(-N345*G345/M345))),0)","v":{"$error":"#N/A"}},null,{"$f":"IF(O345>0, (D345*E345)/O345,0)","v":{"$error":"#N/A"}},{"$f":"IF(M345>0, (M345*(1-EXP(-N345*K345/M345)))*(M345*(1-EXP(-N345*K345/M345))), 0)","v":{"$error":"#N/A"}},{"$f":"IF(M345>0,(M345*(1-EXP(-N345*K345/M345)))*L345,0)","v":{"$error":"#N/A"}},{"$error":"#N/A"},{"$error":"#N/A"},{"$f":"VLOOKUP($F345,VegTypeParameters!$A:$H,8,FALSE)","v":{"$error":"#N/A"}},".",".",".","."]
[5,26,0,0,null,null,null,{"$f":"VLOOKUP(F346,VegTypeParameters!A:G,2,FALSE)","v":{"$error":"#N/A"}},{"$f":"VLOOKUP($F346,VegTypeParameters!$A:$G,5,FALSE)","v":{"$error":"#N/A"}},{"$f":"VLOOKUP($F346,VegTypeParameters!$A:$G,4,FALSE)","v":{"$error":"#N/A"}},{"$f":"G346+FieldBeeForm!$E$11","v":12},{"$f":"IF(J346>0,J346*(1-EXP(-I346*K346/J346)), 0)","v":{"$error":"#N/A"}},{"$f":"(VLOOKUP($F346,VegTypeParameters!A:G,6,FALSE))","v":{"$error":"#N/A"}},{"$f":"(VLOOKUP($F346,VegTypeParameters!A:G,7,FALSE))","v":{"$error":"#N/A"}},{"$f":"IF(M346>0, (M346*(1-EXP(-N346*G346/M346)))*(M346*(1-EXP(-N346*G346/M346))),0)","v":{"$error":"#N/A"}},null,{"$f":"IF(O346>0, (D346*E346)/O346,0)","v":{"$error":"#N/A"}},{"$f":"IF(M346>0, (M346*(1-EXP(-N346*K346/M346)))*(M346*(1-EXP(-N346*K346/M346))), 0)","v":{"$error":"#N/A"}},{"$f":"IF(M346>0,(M346*(1-EXP(-N346*K346/M346)))*L346,0)","v":{"$error":"#N/A"}},{"$error":"#N/A"},{"$error":"#N/A"},{"$f":"VLOOKUP($F346,VegTypeParameters!$A:$H,8,FALSE)","v":{"$error":"#N/A"}},".",".",".","."]
[5,27,0,0,null,null,null,{"$f":"VLOOKUP(F347,VegTypeParameters!A:G,2,FALSE)","v":{"$error":"#N/A"}},{"$f":"VLOOKUP($F347,VegTypeParameters!$A:$G,5,FALSE)","v":{"$error":"#N/A"}},{"$f":"VLOOKUP($F347,VegTypeParameters!$A:$G,4,FALSE)","v":{"$error":"#N/A"}},{"$f":"G347+FieldBeeForm!$E$11","v":12},{"$error":"#N/A"},{"$f":"(VLOOKUP($F347,VegTypeParameters!A:G,6,FALSE))","v":{"$error":"#N/A"}},{"$f":"(VLOOKUP($F347,VegTypeParameters!A:G,7,FALSE))","v":{"$error":"#N/A"}},{"$error":"#N/A"},null,{"$error":"#N/A"},{"$error":"#N/A"},{"$error":"#N/A"},{"$error":"#N/A"},{"$error":"#N/A"},{"$f":"VLOOKUP($F347,VegTypeParameters!$A:$H,8,FALSE)","v":{"$error":"#N/A"}},".",".",".","."]
[5,28,0,0,null,null,null,{"$f":"VLOOKUP(F348,VegTypeParameters!A:G,2,FALSE)","v":{"$error":"#N/A"}},{"$f":"VLOOKUP($F348,VegTypeParameters!$A:$G,5,FALSE)","v":{"$error":"#N/A"}},{"$f":"VLOOKUP($F348,VegTypeParameters!$A:$G,4,FALSE)","v":{"$error":"#N/A"}},{"$f":"G348+FieldBeeForm!$E$11","v":12},{"$error":"#N/A"},{"$f":"(VLOOKUP($F348,VegTypeParameters!A:G,6,FALSE))","v":{"$error":"#N/A"}},{"$f":"(VLOOKUP($F348,VegTypeParameters!A:G,7,FALSE))","v":{"$error":"#N/A"}},{"$error":"#N/A"},null,{"$error":"#N/A"},{"$error":"#N/A"},{"$error":"#N/A"},{"$error":"#N/A"},{"$error":"#N/A"},{"$f":"VLOOKUP($F348,VegTypeParameters!$A:$H,8,FALSE)","v":{"$error":"#N/A"}},".",".",".","."]
[5,29,0,0,null,null,null,{"$f":"VLOOKUP(F349,VegTypeParameters!A:G,2,FALSE)","v":{"$error":"#N/A"}},{"$f":"VLOOKUP($F349,VegTypeParameters!$A:$G,5,FALSE)","v":{"$error":"#N/A"}},{"$f":"VLOOKUP($F349,VegTypeParameters!$A:$G,4,FALSE)","v":{"$error":"#N/A"}},{"$f":"G349+FieldBeeForm!$E$11","v":12},{"$error":"#N/A"},{"$f":"(VLOOKUP($F349,VegTypeParameters!A:G,6,FALSE))","v":{"$error":"#N/A"}},{"$f":"(VLOOKUP($F349,VegTypeParameters!A:G,7,FALSE))","v":{"$error":"#N/A"}},{"$error":"#N/A"},null,{"$error":"#N/A"},{"$error":"#N/A"},{"$error":"#N/A"},{"$error":"#N/A"},{"$error":"#N/A"},{"$f":"VLOOKUP($F349,VegTypeParameters!$A:$H,8,FALSE)","v":{"$error":"#N/A"}},".",".",".","."]
[5,30,0,0,null,null,null,{"$f":"VLOOKUP(F350,VegTypeParameters!A:G,2,FALSE)","v":{"$error":"#N/A"}},{"$f":"VLOOKUP($F350,VegTypeParameters!$A:$G,5,FALSE)","v":{"$error":"#N/A"}},{"$f":"VLOOKUP($F350,VegTypeParameters!$A:$G,4,FALSE)","v":{"$error":"#N/A"}},{"$f":"G350+FieldBeeForm!$E$11","v":12},{"$error":"#N/A"},{"$f":"(VLOOKUP($F350,VegTypeParameters!A:G,6,FALSE))","v":{"$error":"#N/A"}},{"$f":"(VLOOKUP($F350,VegTypeParameters!A:G,7,FALSE))","v":{"$error":"#N/A"}},{"$error":"#N/A"},null,{"$error":"#N/A"},{"$error":"#N/A"},{"$error":"#N/A"},{"$error":"#N/A"},{"$error":"#N/A"},{"$f":"VLOOKUP($F350,VegTypeParameters!$A:$H,8,FALSE)","v":{"$error":"#N/A"}},".",".",".","."]
[5,31,0,0,null,null,null,{"$f":"VLOOKUP(F351,VegTypeParameters!A:G,2,FALSE)","v":{"$error":"#N/A"}},{"$f":"VLOOKUP($F351,VegTypeParameters!$A:$G,5,FALSE)","v":{"$error":"#N/A"}},{"$f":"VLOOKUP($F351,VegTypeParameters!$A:$G,4,FALSE)","v":{"$error":"#N/A"}},{"$f":"G351+FieldBeeForm!$E$11","v":12},{"$error":"#N/A"},{"$f":"(VLOOKUP($F351,VegTypeParameters!A:G,6,FALSE))","v":{"$error":"#N/A"}},{"$f":"(VLOOKUP($F351,VegTypeParameters!A:G,7,FALSE))","v":{"$error":"#N/A"}},{"$error":"#N/A"},null,{"$error":"#N/A"},{"$error":"#N/A"},{"$error":"#N/A"},{"$error":"#N/A"},{"$error":"#N/A"},{"$f":"VLOOKUP($F351,VegTypeParameters!$A:$H,8,FALSE)","v":{"$error":"#N/A"}},".",".",".","."]
[5,32,0,0,null,null,null,{"$f":"VLOOKUP(F352,VegTypeParameters!A:G,2,FALSE)","v":{"$error":"#N/A"}},{"$f":"VLOOKUP($F352,VegTypeParameters!$A:$G,5,FALSE)","v":{"$error":"#N/A"}},{"$f":"VLOOKUP($F352,VegTypeParameters!$A:$G,4,FALSE)","v":{"$error":"#N/A"}},{"$f":"G352+FieldBeeForm!$E$11","v":12},{"$error":"#N/A"},{"$f":"(VLOOKUP($F352,VegTypeParameters!A:G,6,FALSE))","v":{"$error":"#N/A"}},{"$f":"(VLOOKUP($F352,VegTypeParameters!A:G,7,FALSE))","v":{"$error":"#N/A"}},{"$error":"#N/A"},null,{"$error":"#N/A"},{"$error":"#N/A"},{"$error":"#N/A"},{"$error":"#N/A"},{"$error":"#N/A"},{"$f":"VLOOKUP($F352,VegTypeParameters!$A:$H,8,FALSE)","v":{"$error":"#N/A"}},".",".",".","."]
[5,33,0,0,null,null,null,{"$f":"VLOOKUP(F353,VegTypeParameters!A:G,2,FALSE)","v":{"$error":"#N/A"}},{"$f":"VLOOKUP($F353,VegTypeParameters!$A:$G,5,FALSE)","v":{"$error":"#N/A"}},{"$f":"VLOOKUP($F353,VegTypeParameters!$A:$G,4,FALSE)","v":{"$error":"#N/A"}},{"$f":"G353+FieldBeeForm!$E$11","v":12},{"$error":"#N/A"},{"$f":"(VLOOKUP($F353,VegTypeParameters!A:G,6,FALSE))","v":{"$error":"#N/A"}},{"$f":"(VLOOKUP($F353,VegTypeParameters!A:G,7,FALSE))","v":{"$error":"#N/A"}},{"$error":"#N/A"},null,{"$error":"#N/A"},{"$error":"#N/A"},{"$error":"#N/A"},{"$error":"#N/A"},{"$error":"#N/A"},{"$f":"VLOOKUP($F353,VegTypeParameters!$A:$H,8,FALSE)","v":{"$error":"#N/A"}},".",".",".","."]
[5,34,0,0,null,null,null,{"$f":"VLOOKUP(F354,VegTypeParameters!A:G,2,FALSE)","v":{"$error":"#N/A"}},{"$f":"VLOOKUP($F354,VegTypeParameters!$A:$G,5,FALSE)","v":{"$error":"#N/A"}},{"$f":"VLOOKUP($F354,VegTypeParameters!$A:$G,4,FALSE)","v":{"$error":"#N/A"}},{"$f":"G354+FieldBeeForm!$E$11","v":12},{"$error":"#N/A"},{"$f":"(VLOOKUP($F354,VegTypeParameters!A:G,6,FALSE))","v":{"$error":"#N/A"}},{"$f":"(VLOOKUP($F354,VegTypeParameters!A:G,7,FALSE))","v":{"$error":"#N/A"}},{"$error":"#N/A"},null,{"$error":"#N/A"},{"$error":"#N/A"},{"$error":"#N/A"},{"$error":"#N/A"},{"$error":"#N/A"},{"$f":"VLOOKUP($F354,VegTypeParameters!$A:$H,8,FALSE)","v":{"$error":"#N/A"}},".",".",".","."]
[5,35,0,0,null,null,null,{"$f":"VLOOKUP(F355,VegTypeParameters!A:G,2,FALSE)","v":{"$error":"#N/A"}},{"$f":"VLOOKUP($F355,VegTypeParameters!$A:$G,5,FALSE)","v":{"$error":"#N/A"}},{"$f":"VLOOKUP($F355,VegTypeParameters!$A:$G,4,FALSE)","v":{"$error":"#N/A"}},{"$f":"G355+FieldBeeForm!$E$11","v":12},{"$error":"#N/A"},{"$f":"(VLOOKUP($F355,VegTypeParameters!A:G,6,FALSE))","v":{"$error":"#N/A"}},{"$f":"(VLOOKUP($F355,VegTypeParameters!A:G,7,FALSE))","v":{"$error":"#N/A"}},{"$error":"#N/A"},null,{"$error":"#N/A"},{"$error":"#N/A"},{"$error":"#N/A"},{"$error":"#N/A"},{"$error":"#N/A"},{"$f":"VLOOKUP($F355,VegTypeParameters!$A:$H,8,FALSE)","v":{"$error":"#N/A"}},".",".",".","."]
[null,null,null,"Horizontal extent of pollinator plant cover (m2) per season",null,null,null,"Vertical extent of pollinator plant cover (m2) per season",null,null,null,"Number of different pollinator plant species per season"]
["Map Unit #","Vegetation Entry",null,"Spatial extent of Veg Type (m2)","Early","Mid","Late","Spatial extent of Veg Type (m2)","Early","Mid","Late","Early","Mid","Late"]
[{"$f":"A321","v":5},{"$f":"B321","v":1},null,{"$f":"+IF(ISNA(VLOOKUP(B358,B$321:D$355, 3, FALSE)),0,VLOOKUP(B358,B$321:D$355, 3, FALSE))","v":0},{"$f":"+IF(SUMIFS(T$321:T$355, B$321:B$355, $B358, V$321:V$355, \"*\"&\"Early\"&\"*\") <=$D358, SUMIFS(T$321:T$355, B$321:B$355, $B358, V$321:V$355, \"*\"&\"Early\"&\"*\"), $D358)","v":0},{"$f":"+IF(SUMIFS(T$321:T$355,B$321:B$355, $B358, V$321:V$355, \"*\"&\"Mid\"&\"*\") <=$D358, SUMIFS(T$321:T$355,B$321:B$355, $B358, V$321:V$355, \"*\"&\"Mid\"&\"*\"), $D358)","v":0},{"$f":"+IF(SUMIFS(T$321:T$355, B$321:B$355, $B358, $V$321:$V$355, \"*\"&\"Late\"&\"*\") <=$D358, SUMIFS(T$321:T$355,B$321:B$355, $B358,$V$321:$V$355, \"*\"&\"Late\"&\"*\"), $D358)","v":0},{"$f":"+IF(ISNA(VLOOKUP(B358,B$321:D$355, 3, FALSE)),0,VLOOKUP(B358,B$321:D$355, 3, FALSE))","v":0},{"$f":"+IF(SUMIFS($U$321:$U$355, $B$321:$B$355, $B358, $V$321:$V$355, \"*\"&\"Early\"&\"*\") <=$D358, SUMIFS($U$321:$U$355, $B$321:$B$355, $B358, $V$321:$V$355, \"*\"&\"Early\"&\"*\"), $D358)","v":0},{"$f":"+IF(SUMIFS($U$321:$U$355, $B$321:$B$355, $B358, $V$321:$V$355, \"*\"&\"Mid\"&\"*\") <=$D358, SUMIFS($U$321:$U$355, $B$321:$B$355, $B358, $V$321:$V$355, \"*\"&\"Mid\"&\"*\"), $D358)","v":0},{"$f":"+IF(SUMIFS($U$321:$U$355, $B$321:$B$355, $B358, $V$321:$V$355, \"*\"&\"Late\"&\"*\") <=$D358, SUMIFS($U$321:$U$355, $B$321:$B$355, $B358, $V$321:$V$355, \"*\"&\"Late\"&\"*\"), $D358)","v":0}," "]
[{"$f":"A322","v":5},2,null,{"$f":"+IF(ISNA(VLOOKUP(B359,B$321:D$355, 3, FALSE)),0,VLOOKUP(B359,B$321:D$355, 3, FALSE))","v":0},{"$f":"+IF(SUMIFS(T$321:T$355, B$321:B$355, $B359, V$321:V$355, \"*\"&\"Early\"&\"*\") <=$D359, SUMIFS(T$321:T$355, B$321:B$355, $B359, V$321:V$355, \"*\"&\"Early\"&\"*\"), $D359)","v":0},{"$f":"+IF(SUMIFS(T$321:T$355,B$321:B$355, $B359, V$321:V$355, \"*\"&\"Mid\"&\"*\") <=$D359, SUMIFS(T$321:T$355,B$321:B$355, $B359, V$321:V$355, \"*\"&\"Mid\"&\"*\"), $D359)","v":0},{"$f":"+IF(SUMIFS(T$321:T$355, B$321:B$355, $B359, $V$321:$V$355, \"*\"&\"Late\"&\"*\") <=$D359, SUMIFS(T$321:T$355,B$321:B$355, $B359,$V$321:$V$355, \"*\"&\"Late\"&\"*\"), $D359)","v":0},{"$f":"+IF(ISNA(VLOOKUP(B359,B$321:D$355, 3, FALSE)),0,VLOOKUP(B359,B$321:D$355, 3, FALSE))","v":0},{"$f":"+IF(SUMIFS($U$321:$U$355, $B$321:$B$355, $B359, $V$321:$V$355, \"*\"&\"Early\"&\"*\") <=$D359, SUMIFS($U$321:$U$355, $B$321:$B$355, $B359, $V$321:$V$355, \"*\"&\"Early\"&\"*\"), $D359)","v":0},{"$f":"+IF(SUMIFS($U$321:$U$355, $B$321:$B$355, $B359, $V$321:$V$355, \"*\"&\"Mid\"&\"*\") <=$D359, SUMIFS($U$321:$U$355, $B$321:$B$355, $B359, $V$321:$V$355, \"*\"&\"Mid\"&\"*\"), $D359)","v":0},{"$f":"+IF(SUMIFS($U$321:$U$355, $B$321:$B$355, $B359, $V$321:$V$355, \"*\"&\"Late\"&\"*\") <=$D359, SUMIFS($U$321:$U$355, $B$321:$B$355, $B359, $V$321:$V$355, \"*\"&\"Late\"&\"*\"), $D359)","v":0}," "]
[{"$f":"A323","v":5},3,null,0,0,0,0,0,0,0,0]
[{"$f":"A324","v":5},4,null,0,0,0,0,0,0,0,0]
[{"$f":"A325","v":5},5,null,0,0,0,0,0,0,0,0]
[{"$f":"A326","v":5},6,null,0,0,0,0,0,0,0,0]
[{"$f":"A327","v":5},7,null,0,0,0,0,0,0,0,0]
[{"$f":"A328","v":5},8,null,0,0,0,0,0,0,0,0]
[{"$f":"A329","v":5},9,null,0,0,0,0,0,0,0,0]
[{"$f":"A330","v":5},10,null,0,0,0,0,0,0,0,0]
[{"$f":"A331","v":5},11,null,{"$f":"+IF(ISNA(VLOOKUP(B368,B$321:D$355, 3, FALSE)),0,VLOOKUP(B368,B$321:D$355, 3, FALSE))","v":0},{"$f":"+IF(SUMIFS(T$321:T$355, B$321:B$355, $B368, V$321:V$355, \"*\"&\"Early\"&\"*\") <=$D368, SUMIFS(T$321:T$355, B$321:B$355, $B368, V$321:V$355, \"*\"&\"Early\"&\"*\"), $D368)","v":0},{"$f":"+IF(SUMIFS(T$321:T$355,B$321:B$355, $B368, V$321:V$355, \"*\"&\"Mid\"&\"*\") <=$D368, SUMIFS(T$321:T$355,B$321:B$355, $B368, V$321:V$355, \"*\"&\"Mid\"&\"*\"), $D368)","v":0},{"$f":"+IF(SUMIFS(T$321:T$355, B$321:B$355, $B368, $V$321:$V$355, \"*\"&\"Late\"&\"*\") <=$D368, SUMIFS(T$321:T$355,B$321:B$355, $B368,$V$321:$V$355, \"*\"&\"Late\"&\"*\"), $D368)","v":0},{"$f":"+IF(ISNA(VLOOKUP(B368,B$321:D$355, 3, FALSE)),0,VLOOKUP(B368,B$321:D$355, 3, FALSE))","v":0},0,0,0]
[{"$f":"A332","v":5},12,null,0,0,0,0,0,0,0,0]
[{"$f":"A333","v":5},13,null,0,0,0,0,0,0,0,0]
[{"$f":"A334","v":5},14,null,0,0,0,0,0,0,0,0]
[{"$f":"A335","v":5},15,null,0,0,0,0,0,0,0,0]
[{"$f":"A336","v":5},16,null,0,0,0,0,0,0,0,0]
[{"$f":"A337","v":5},17,null,0,0,0,0,0,0,0,0]
[{"$f":"A338","v":5},18,null,0,0,0,0,0,0,0,0]
[{"$f":"A339","v":5},19,null,0,0,0,0,0,0,0,0]
[{"$f":"A340","v":5},20,null,0,0,0,0,0,0,0,0]
[{"$f":"A341","v":5},21,null,0,0,0,0,0,0,0,0]
[{"$f":"A342","v":5},22,null,0,0,0,0,0,0,0,0]
[{"$f":"A343","v":5},23,null,0,0,0,0,0,0,0,0]
[{"$f":"A344","v":5},24,null,0,0,0,0,0,0,0,0]
[{"$f":"A345","v":5},25,null,0,0,0,0,0,0,0,0]
[{"$f":"A346","v":5},26,null,0,0,0,0,0,0,0,0]
[{"$f":"A347","v":5},27,null,0,0,0,0,0,0,0,0]
[{"$f":"A348","v":5},28,null,0,0,0,0,0,0,0,0]
[{"$f":"A349","v":5},29,null,0,0,0,0,0,0,0,0]
[{"$f":"A350","v":5},30,null,0,0,0,0,0,0,0,0]
[{"$f":"A351","v":5},31,null,0,0,0,0,0,0,0,0]
[{"$f":"A352","v":5},32,null,0,0,0,0,0,0,0,0]
[{"$f":"A353","v":5},33,null,0,0,0,0,0,0,0,0]
[{"$f":"A354","v":5},34,null,0,0,0,0,0,0,0,0]
[{"$f":"A355","v":5},35,null,0,0,0,0,0,0,0,0]
[{"$f":"A321","v":5},"Total",null,{"$f":"+SUM(D358:D392)","v":0},{"$f":"+SUM(E358:E392)","v":0},0,0,0,0,0,0,{"$f":"+X320","v":7},{"$f":"+Y320","v":10},{"$f":"+Z320","v":7}]
[null," ",null,{"$f":"D393","v":0},"Map Unit Size in Acres",null,{"$f":"FieldBeeForm!I14","v":20000},"Value entered in FieldBeeForm (Should be same as cell C269)"]
[]
["Enter only in yellow cells. Leave rest untouched.",null,null,null,null,null,"Enter the current year age in column G for each vegetation type. This age will be added to the assessment year (input on Field data form) to determine time series age in column K. If you are interested in just the current effects, enter a '0' in cell E11 of the Field data form."]
["Map Unit","Vegetation Entry","Map Unit Size","Spatial extent of Veg Type","Existing Cover Class for VegType","Species/ VegType","Existing Age of Average Plant \n(for S enter 1, for Sa enter 2, for P enter 3, for M enter 5, for D enter 10)","Species/Vegetation Type Descriptions","Ht Rate","Ht max","Future Age","Future Height","Canopy Width Max (m)","Canopy Width Rate","Existing Age canopy area per plant",null,"Estimated # Individuals","Future Horizontal Surface Area per plant (width x width)","Future Vertical Surface Area per plant (width x height)","Horizontal Surface Area Across Map Unit","Vertical Surface Area Across Map Unit","Season(s)","Season(s) (.)","Early","Mid","Late"]
["#","#"," sq ft","m2","%","code","yrs",null,"m/yr","m","yrs","m","m","m/yr","m2",null,"number","m2","m2","m2","m2",null,null,{"$f":"SUM(IF(FREQUENCY(MATCH(X399:X433, X399:X433,0),MATCH(X399:X433, X399:X433,0))>0,1))-1","v":7},{"$f":"SUM(IF(FREQUENCY(MATCH(Y399:Y433, Y399:Y433,0),MATCH(Y399:Y433, Y399:Y433,0))>0,1))-1","v":10},{"$f":"SUM(IF(FREQUENCY(MATCH(Z399:Z433, Z399:Z433,0),MATCH(Z399:Z433, Z399:Z433,0))>0,1))-1","v":7}]
[6,1,null,{"$f":"(0.092903*C399)*E399","v":0},0.06,1600,5,{"$f":"VLOOKUP(F399,VegTypeParameters!A:G,2,FALSE)","v":"Atriplex"},{"$f":"VLOOKUP($F399,VegTypeParameters!$A:$G,5,FALSE)","v":3.2962962962962963},{"$f":"VLOOKUP($F399,VegTypeParameters!$A:$G,4,FALSE)","v":3},{"$f":"G399+FieldBeeForm!$E$11","v":17},{"$f":"IF(J399>0,J399*(1-EXP(-I399*K399/J399)), 0)","v":2.9999999768298276},{"$f":"(VLOOKUP($F399,VegTypeParameters!A:G,6,FALSE))","v":5},{"$f":"(VLOOKUP($F399,VegTypeParameters!A:G,7,FALSE))","v":7.1111111111111107},{"$f":"IF(M399>0, (M399*(1-EXP(-N399*G399/M399)))*(M399*(1-EXP(-N399*G399/M399))),0)","v":24.959217254150069},null,{"$f":"IF(O399>0, (D399*E399)/O399,0)","v":0},{"$f":"IF(M399>0, (M399*(1-EXP(-N399*K399/M399)))*(M399*(1-EXP(-N399*K399/M399))), 0)","v":24.99999999841986},{"$f":"IF(M399>0,(M399*(1-EXP(-N399*K399/M399)))*L399,0)","v":14.999999883675097},{"$f":"R399*Q399","v":0},{"$f":"S399*Q399","v":0},{"$f":"VLOOKUP($F399,VegTypeParameters!$A:$H,8,FALSE)","v":"Mid/Late"},{"$f":"+IF(ISNA(V399), \".\",  V399)","v":"Mid/Late"},{"$f":"IF($W399=\"Early/Mid\",$H399,IF($W399=\"Early\", $H399, IF($W399=\"Early/Mid/Late\", $H399,\".\")))","v":"."},{"$f":"IF($W399=\"Early/Mid\",$H399,IF($W399=\"Mid\", $H399, IF($W399=\"Mid/Late\", $H399, IF($W399=\"Early/Mid/Late\", $H399,\".\"))))","v":"Atriplex"},{"$f":"IF($W399=\"Mid/Late\",$H399,IF($W399=\"Late\", $H399, IF($W399=\"Early/Mid/Late\", $H399,\".\")))","v":"Atriplex"}]
[6,2,{"$f":"C$399","v":0},{"$f":"(0.092903*C400)*E400","v":0},0.03,4200,3,{"$f":"VLOOKUP(F400,VegTypeParameters!A:G,2,FALSE)","v":"Helianthus"},{"$f":"VLOOKUP($F400,VegTypeParameters!$A:$G,5,FALSE)","v":6.5},{"$f":"VLOOKUP($F400,VegTypeParameters!$A:$G,4,FALSE)","v":2.5},{"$f":"G400+FieldBeeForm!$E$11","v":15},2.5,{"$f":"(VLOOKUP($F400,VegTypeParameters!A:G,6,FALSE))","v":0.75},{"$f":"(VLOOKUP($F400,VegTypeParameters!A:G,7,FALSE))","v":1.25},0.55494534708652032,null,0,0.56249999998437616,1.8749999999739604,0,0,{"$f":"VLOOKUP($F400,VegTypeParameters!$A:$H,8,FALSE)","v":"Mid/Late"},{"$f":"+IF(ISNA(V400), \".\",  V400)","v":"Mid/Late"},{"$f":"IF($W400=\"Early/Mid\",$H400,IF($W400=\"Early\", $H400, IF($W400=\"Early/Mid/Late\", $H400,\".\")))","v":"."},{"$f":"IF($W400=\"Early/Mid\",$H400,IF($W400=\"Mid\", $H400, IF($W400=\"Mid/Late\", $H400, IF($W400=\"Early/Mid/Late\", $H400,\".\"))))","v":"Helianthus"},{"$f":"IF($W400=\"Mid/Late\",$H400,IF($W400=\"Late\", $H400, IF($W400=\"Early/Mid/Late\", $H400,\".\")))","v":"Helianthus"}]
[6,3,{"$f":"C$399","v":0},0,0.08,4000,3,{"$f":"VLOOKUP(F401,VegTypeParameters!A:G,2,FALSE)","v":"Grindelia"},{"$f":"VLOOKUP($F401,VegTypeParameters!$A:$G,5,FALSE)","v":1.6666666666666667},{"$f":"VLOOKUP($F401,VegTypeParameters!$A:$G,4,FALSE)","v":2.5},{"$f":"G401+FieldBeeForm!$E$11","v":15},2.4998865001755939,{"$f":"(VLOOKUP($F401,VegTypeParameters!A:G,6,FALSE))","v":2},{"$f":"(VLOOKUP($F401,VegTypeParameters!A:G,7,FALSE))","v":1.3333333333333333},2.9905802896620353,null,0,3.9996368088065144,4.9995460110081433,0,0,{"$f":"VLOOKUP($F401,VegTypeParameters!$A:$H,8,FALSE)","v":"Mid/Late"},"Mid/Late",".","Grindelia","Grindelia"]
[6,4,0,0,0.08,7000,3,{"$f":"VLOOKUP(F402,VegTypeParameters!A:G,2,FALSE)","v":"Salix (shrub)"},{"$f":"VLOOKUP($F402,VegTypeParameters!$A:$G,5,FALSE)","v":0.73},{"$f":"VLOOKUP($F402,VegTypeParameters!$A:$G,4,FALSE)","v":3.5},{"$f":"G402+FieldBeeForm!$E$11","v":15},3.3467689644197414,{"$f":"(VLOOKUP($F402,VegTypeParameters!A:G,6,FALSE))","v":2.5},{"$f":"(VLOOKUP($F402,VegTypeParameters!A:G,7,FALSE))","v":0.55000000000000004},1.4589539561403246,null,0,5.7974627077191743,8.0583238111294335,0,0,{"$f":"VLOOKUP($F402,VegTypeParameters!$A:$H,8,FALSE)","v":"Early"},"Early","Salix (shrub)",".","."]
[6,5,0,0,0.08,8400,5,{"$f":"VLOOKUP(F403,VegTypeParameters!A:G,2,FALSE)","v":"Weeds, non-invasive and not beneficial to pollinators"},{"$f":"VLOOKUP($F403,VegTypeParameters!$A:$G,5,FALSE)","v":0},{"$f":"VLOOKUP($F403,VegTypeParameters!$A:$G,4,FALSE)","v":0},{"$f":"G403+FieldBeeForm!$E$11","v":17},0,{"$f":"(VLOOKUP($F403,VegTypeParameters!A:G,6,FALSE))","v":0},{"$f":"(VLOOKUP($F403,VegTypeParameters!A:G,7,FALSE))","v":0},0,null,0,0,0,0,0,{"$f":"VLOOKUP($F403,VegTypeParameters!$A:$H,8,FALSE)","v":"Never"},"Never",".",".","."]
[6,6,0,0,0.08,5300,3,{"$f":"VLOOKUP(F404,VegTypeParameters!A:G,2,FALSE)","v":"Medicago "},{"$f":"VLOOKUP($F404,VegTypeParameters!$A:$G,5,FALSE)","v":0.5},{"$f":"VLOOKUP($F404,VegTypeParameters!$A:$G,4,FALSE)","v":0.5},{"$f":"G404+FieldBeeForm!$E$11","v":15},0.49999984704883976,{"$f":"(VLOOKUP($F404,VegTypeParameters!A:G,6,FALSE))","v":0.7},{"$f":"(VLOOKUP($F404,VegTypeParameters!A:G,7,FALSE))","v":0.7},0.44242326156605982,null,0,0.48999970021577172,0.34999978586840841,0,0,{"$f":"VLOOKUP($F404,VegTypeParameters!$A:$H,8,FALSE)","v":"Mid/Late"},"Mid/Late",".","Medicago ","Medicago "]
[6,7,0,0,0.08,1600,3,{"$f":"VLOOKUP(F405,VegTypeParameters!A:G,2,FALSE)","v":"Atriplex"},{"$f":"VLOOKUP($F405,VegTypeParameters!$A:$G,5,FALSE)","v":3.2962962962962963},{"$f":"VLOOKUP($F405,VegTypeParameters!$A:$G,4,FALSE)","v":3},{"$f":"G405+FieldBeeForm!$E$11","v":15},2.999999791404568,{"$f":"(VLOOKUP($F405,VegTypeParameters!A:G,6,FALSE))","v":5},{"$f":"(VLOOKUP($F405,VegTypeParameters!A:G,7,FALSE))","v":7.1111111111111107},24.303496604054391,null,0,24.999999972834292,14.999998948873127,0,0,{"$f":"VLOOKUP($F405,VegTypeParameters!$A:$H,8,FALSE)","v":"Mid/Late"},"Mid/Late",".","Atriplex","Atriplex"]
[6,8,0,0,0.03,7500,3,{"$f":"VLOOKUP(F406,VegTypeParameters!A:G,2,FALSE)","v":"Scrophularia"},{"$f":"VLOOKUP($F406,VegTypeParameters!$A:$G,5,FALSE)","v":1.2},{"$f":"VLOOKUP($F406,VegTypeParameters!$A:$G,4,FALSE)","v":1.2},{"$f":"G406+FieldBeeForm!$E$11","v":15},1.1999996329172153,{"$f":"(VLOOKUP($F406,VegTypeParameters!A:G,6,FALSE))","v":0.3},{"$f":"(VLOOKUP($F406,VegTypeParameters!A:G,7,FALSE))","v":0.3},8.1261415389684455E-2,null,0,8.9999944937590726E-2,0.3599997797503629,0,0,{"$f":"VLOOKUP($F406,VegTypeParameters!$A:$H,8,FALSE)","v":"Early/Mid"},"Early/Mid","Scrophularia","Scrophularia","."]
[6,9,0,0,0.03,3500,3,{"$f":"VLOOKUP(F407,VegTypeParameters!A:G,2,FALSE)","v":"Ficus carica"},{"$f":"VLOOKUP($F407,VegTypeParameters!$A:$G,5,FALSE)","v":0},{"$f":"VLOOKUP($F407,VegTypeParameters!$A:$G,4,FALSE)","v":0},{"$f":"G407+FieldBeeForm!$E$11","v":15},0,{"$f":"(VLOOKUP($F407,VegTypeParameters!A:G,6,FALSE))","v":0},{"$f":"(VLOOKUP($F407,VegTypeParameters!A:G,7,FALSE))","v":0},0,null,0,0,0,0,0,{"$f":"VLOOKUP($F407,VegTypeParameters!$A:$H,8,FALSE)","v":"Never"},"Never",".",".","."]
[6,10,0,0,0.03,6200,3,{"$f":"VLOOKUP(F408,VegTypeParameters!A:G,2,FALSE)","v":"Other late blooming native plants beneficial to pollinators"},{"$f":"VLOOKUP($F408,VegTypeParameters!$A:$G,5,FALSE)","v":0.25},{"$f":"VLOOKUP($F408,VegTypeParameters!$A:$G,4,FALSE)","v":1},{"$f":"G408+FieldBeeForm!$E$11","v":15},0.97648225414399092,{"$f":"(VLOOKUP($F408,VegTypeParameters!A:G,6,FALSE))","v":0.5},{"$f":"(VLOOKUP($F408,VegTypeParameters!A:G,7,FALSE))","v":0.25},0.15088168701775109,null,0,0.24972353429050623,0.48797108853574861,0,0,{"$f":"VLOOKUP($F408,VegTypeParameters!$A:$H,8,FALSE)","v":"Late"},"Late",".",".","Other late blooming native plants beneficial to pollinators"]
[6,11,0,0,0.03,2500,3,{"$f":"VLOOKUP(F409,VegTypeParameters!A:G,2,FALSE)","v":"Clarkia"},{"$f":"VLOOKUP($F409,VegTypeParameters!$A:$G,5,FALSE)","v":0.4},{"$f":"VLOOKUP($F409,VegTypeParameters!$A:$G,4,FALSE)","v":0.4},{"$f":"G409+FieldBeeForm!$E$11","v":15},0.39999987763907185,{"$f":"(VLOOKUP($F409,VegTypeParameters!A:G,6,FALSE))","v":0.1},{"$f":"(VLOOKUP($F409,VegTypeParameters!A:G,7,FALSE))","v":0.1},9.029046154409387E-3,null,0,9.9999938819545289E-3,3.9999975527818116E-2,0,0,{"$f":"VLOOKUP($F409,VegTypeParameters!$A:$H,8,FALSE)","v":"Early/Mid"},"Early/Mid","Clarkia","Clarkia","."]
[6,12,0,0,0.08,5000,3,{"$f":"VLOOKUP(F410,VegTypeParameters!A:G,2,FALSE)","v":"Lupinus spp."},{"$f":"VLOOKUP($F410,VegTypeParameters!$A:$G,5,FALSE)","v":0.98000000000000009},{"$f":"VLOOKUP($F410,VegTypeParameters!$A:$G,4,FALSE)","v":3},{"$f":"G410+FieldBeeForm!$E$11","v":15},2.9776602507872267,{"$f":"(VLOOKUP($F410,VegTypeParameters!A:G,6,FALSE))","v":3},{"$f":"(VLOOKUP($F410,VegTypeParameters!A:G,7,FALSE))","v":1.08},3.925206627733659,null,0,8.9188851385636738,8.8926342217348378,0,0,{"$f":"VLOOKUP($F410,VegTypeParameters!$A:$H,8,FALSE)","v":"Early/Mid/Late"},"Early/Mid/Late","Lupinus spp.","Lupinus spp.","Lupinus spp."]
[6,13,0,0,0.08,6000,3,{"$f":"VLOOKUP(F411,VegTypeParameters!A:G,2,FALSE)","v":"Orchard"},{"$f":"VLOOKUP($F411,VegTypeParameters!$A:$G,5,FALSE)","v":0.5},{"$f":"VLOOKUP($F411,VegTypeParameters!$A:$G,4,FALSE)","v":10},{"$f":"G411+FieldBeeForm!$E$11","v":15},5.2763344725898529,{"$f":"(VLOOKUP($F411,VegTypeParameters!A:G,6,FALSE))","v":6},{"$f":"(VLOOKUP($F411,VegTypeParameters!A:G,7,FALSE))","v":0.5},1.7614473685136525,null,0,18.326714576526665,22.58783601812447,0,0,{"$f":"VLOOKUP($F411,VegTypeParameters!$A:$H,8,FALSE)","v":"Early"},"Early","Orchard",".","."]
[6,14,0,0,0.03,3300,5,{"$f":"VLOOKUP(F412,VegTypeParameters!A:G,2,FALSE)","v":"Eschscholzia"},{"$f":"VLOOKUP($F412,VegTypeParameters!$A:$G,5,FALSE)","v":0.6},{"$f":"VLOOKUP($F412,VegTypeParameters!$A:$G,4,FALSE)","v":0.3},{"$f":"G412+FieldBeeForm!$E$11","v":17},0.29999999999999949,{"$f":"(VLOOKUP($F412,VegTypeParameters!A:G,6,FALSE))","v":0.15},{"$f":"(VLOOKUP($F412,VegTypeParameters!A:G,7,FALSE))","v":0.3},2.2497957049536645E-2,null,0,2.2499999999999923E-2,4.4999999999999846E-2,0,0,{"$f":"VLOOKUP($F412,VegTypeParameters!$A:$H,8,FALSE)","v":"Early/Mid"},"Early/Mid","Eschscholzia","Eschscholzia","."]
[6,15,0,0,0.03,5600,3,{"$f":"VLOOKUP(F413,VegTypeParameters!A:G,2,FALSE)","v":"Native forbs and graminoids not beneficial to pollinators"},{"$f":"VLOOKUP($F413,VegTypeParameters!$A:$G,5,FALSE)","v":0},{"$f":"VLOOKUP($F413,VegTypeParameters!$A:$G,4,FALSE)","v":0},{"$f":"G413+FieldBeeForm!$E$11","v":15},{"$f":"IF(J413>0,J413*(1-EXP(-I413*K413/J413)), 0)","v":0},{"$f":"(VLOOKUP($F413,VegTypeParameters!A:G,6,FALSE))","v":0},{"$f":"(VLOOKUP($F413,VegTypeParameters!A:G,7,FALSE))","v":0},{"$f":"IF(M413>0, (M413*(1-EXP(-N413*G413/M413)))*(M413*(1-EXP(-N413*G413/M413))),0)","v":0},null,{"$f":"IF(O413>0, (D413*E413)/O413,0)","v":0},{"$f":"IF(M413>0, (M413*(1-EXP(-N413*K413/M413)))*(M413*(1-EXP(-N413*K413/M413))), 0)","v":0},{"$f":"IF(M413>0,(M413*(1-EXP(-N413*K413/M413)))*L413,0)","v":0},0,0,{"$f":"VLOOKUP($F413,VegTypeParameters!$A:$H,8,FALSE)","v":"Never"},"Never",".",".","."]
[6,16,0,0,0.08,3800,3,{"$f":"VLOOKUP(F414,VegTypeParameters!A:G,2,FALSE)","v":"Gilia"},{"$f":"VLOOKUP($F414,VegTypeParameters!$A:$G,5,FALSE)","v":0.6},{"$f":"VLOOKUP($F414,VegTypeParameters!$A:$G,4,FALSE)","v":0.3},{"$f":"G414+FieldBeeForm!$E$11","v":15},{"$f":"IF(J414>0,J414*(1-EXP(-I414*K414/J414)), 0)","v":0.2999999999999719},{"$f":"(VLOOKUP($F414,VegTypeParameters!A:G,6,FALSE))","v":0.15},{"$f":"(VLOOKUP($F414,VegTypeParameters!A:G,7,FALSE))","v":0.3},{"$f":"IF(M414>0, (M414*(1-EXP(-N414*G414/M414)))*(M414*(1-EXP(-N414*G414/M414))),0)","v":2.2388594396827964E-2},null,{"$f":"IF(O414>0, (D414*E414)/O414,0)","v":0},{"$f":"IF(M414>0, (M414*(1-EXP(-N414*K414/M414)))*(M414*(1-EXP(-N414*K414/M414))), 0)","v":2.2499999999995784E-2},{"$f":"IF(M414>0,(M414*(1-EXP(-N414*K414/M414)))*L414,0)","v":4.4999999999991568E-2},0,0,{"$f":"VLOOKUP($F414,VegTypeParameters!$A:$H,8,FALSE)","v":"Mid"},"Mid",".","Gilia","."]
[6,17,0,0,0.08,1500,3,{"$f":"VLOOKUP(F415,VegTypeParameters!A:G,2,FALSE)","v":"Asclepias"},{"$f":"VLOOKUP($F415,VegTypeParameters!$A:$G,5,FALSE)","v":0.8},{"$f":"VLOOKUP($F415,VegTypeParameters!$A:$G,4,FALSE)","v":0.8},{"$f":"G415+FieldBeeForm!$E$11","v":15},0.79999975527814371,{"$f":"(VLOOKUP($F415,VegTypeParameters!A:G,6,FALSE))","v":0.2},{"$f":"(VLOOKUP($F415,VegTypeParameters!A:G,7,FALSE))","v":0.2},3.6116184617637548E-2,null,0,3.9999975527818116E-2,0.15999990211127246,0,0,{"$f":"VLOOKUP($F415,VegTypeParameters!$A:$H,8,FALSE)","v":"Early/Mid/Late"},"Early/Mid/Late","Asclepias","Asclepias","Asclepias"]
[6,18,0,0,5.0000000000000001E-3,1600,1,{"$f":"VLOOKUP(F416,VegTypeParameters!A:G,2,FALSE)","v":"Atriplex"},{"$f":"VLOOKUP($F416,VegTypeParameters!$A:$G,5,FALSE)","v":3.2962962962962963},{"$f":"VLOOKUP($F416,VegTypeParameters!$A:$G,4,FALSE)","v":3},{"$f":"G416+FieldBeeForm!$E$11","v":13},2.9999981220660135,{"$f":"(VLOOKUP($F416,VegTypeParameters!A:G,6,FALSE))","v":5},{"$f":"(VLOOKUP($F416,VegTypeParameters!A:G,7,FALSE))","v":7.1111111111111107},14.395290762184326,null,0,24.999999532966985,14.999990470220251,0,0,{"$f":"VLOOKUP($F416,VegTypeParameters!$A:$H,8,FALSE)","v":"Mid/Late"},"Mid/Late",".","Atriplex","Atriplex"]
[6,19,0,0,null,null,null,{"$f":"VLOOKUP(F417,VegTypeParameters!A:G,2,FALSE)","v":{"$error":"#N/A"}},{"$f":"VLOOKUP($F417,VegTypeParameters!$A:$G,5,FALSE)","v":{"$error":"#N/A"}},{"$f":"VLOOKUP($F417,VegTypeParameters!$A:$G,4,FALSE)","v":{"$error":"#N/A"}},{"$f":"G417+FieldBeeForm!$E$11","v":12},{"$error":"#N/A"},{"$f":"(VLOOKUP($F417,VegTypeParameters!A:G,6,FALSE))","v":{"$error":"#N/A"}},{"$f":"(VLOOKUP($F417,VegTypeParameters!A:G,7,FALSE))","v":{"$error":"#N/A"}},{"$error":"#N/A"},null,{"$error":"#N/A"},{"$error":"#N/A"},{"$error":"#N/A"},{"$error":"#N/A"},{"$error":"#N/A"},{"$f":"VLOOKUP($F417,VegTypeParameters!$A:$H,8,FALSE)","v":{"$error":"#N/A"}},".",".",".","."]
[6,20,0,0,null,null,null,{"$f":"VLOOKUP(F418,VegTypeParameters!A:G,2,FALSE)","v":{"$error":"#N/A"}},{"$f":"VLOOKUP($F418,VegTypeParameters!$A:$G,5,FALSE)","v":{"$error":"#N/A"}},{"$f":"VLOOKUP($F418,VegTypeParameters!$A:$G,4,FALSE)","v":{"$error":"#N/A"}},{"$f":"G418+FieldBeeForm!$E$11","v":12},{"$error":"#N/A"},{"$f":"(VLOOKUP($F418,VegTypeParameters!A:G,6,FALSE))","v":{"$error":"#N/A"}},{"$f":"(VLOOKUP($F418,VegTypeParameters!A:G,7,FALSE))","v":{"$error":"#N/A"}},{"$error":"#N/A"},null,{"$error":"#N/A"},{"$error":"#N/A"},{"$error":"#N/A"},{"$error":"#N/A"},{"$error":"#N/A"},{"$f":"VLOOKUP($F418,VegTypeParameters!$A:$H,8,FALSE)","v":{"$error":"#N/A"}},".",".",".","."]
[6,21,0,0,null,null,null,{"$f":"VLOOKUP(F419,VegTypeParameters!A:G,2,FALSE)","v":{"$error":"#N/A"}},{"$f":"VLOOKUP($F419,VegTypeParameters!$A:$G,5,FALSE)","v":{"$error":"#N/A"}},{"$f":"VLOOKUP($F419,VegTypeParameters!$A:$G,4,FALSE)","v":{"$error":"#N/A"}},{"$f":"G419+FieldBeeForm!$E$11","v":12},{"$error":"#N/A"},{"$f":"(VLOOKUP($F419,VegTypeParameters!A:G,6,FALSE))","v":{"$error":"#N/A"}},{"$f":"(VLOOKUP($F419,VegTypeParameters!A:G,7,FALSE))","v":{"$error":"#N/A"}},{"$error":"#N/A"},null,{"$error":"#N/A"},{"$error":"#N/A"},{"$error":"#N/A"},{"$error":"#N/A"},{"$error":"#N/A"},{"$f":"VLOOKUP($F419,VegTypeParameters!$A:$H,8,FALSE)","v":{"$error":"#N/A"}},".",".",".","."]
[6,22,0,0,null,null,null,{"$f":"VLOOKUP(F420,VegTypeParameters!A:G,2,FALSE)","v":{"$error":"#N/A"}},{"$f":"VLOOKUP($F420,VegTypeParameters!$A:$G,5,FALSE)","v":{"$error":"#N/A"}},{"$f":"VLOOKUP($F420,VegTypeParameters!$A:$G,4,FALSE)","v":{"$error":"#N/A"}},{"$f":"G420+FieldBeeForm!$E$11","v":12},{"$error":"#N/A"},{"$f":"(VLOOKUP($F420,VegTypeParameters!A:G,6,FALSE))","v":{"$error":"#N/A"}},{"$f":"(VLOOKUP($F420,VegTypeParameters!A:G,7,FALSE))","v":{"$error":"#N/A"}},{"$error":"#N/A"},null,{"$error":"#N/A"},{"$error":"#N/A"},{"$error":"#N/A"},{"$error":"#N/A"},{"$error":"#N/A"},{"$f":"VLOOKUP($F420,VegTypeParameters!$A:$H,8,FALSE)","v":{"$error":"#N/A"}},".",".",".","."]
[6,23,0,0,null,null,null,{"$f":"VLOOKUP(F421,VegTypeParameters!A:G,2,FALSE)","v":{"$error":"#N/A"}},{"$f":"VLOOKUP($F421,VegTypeParameters!$A:$G,5,FALSE)","v":{"$error":"#N/A"}},{"$f":"VLOOKUP($F421,VegTypeParameters!$A:$G,4,FALSE)","v":{"$error":"#N/A"}},{"$f":"G421+FieldBeeForm!$E$11","v":12},{"$error":"#N/A"},{"$f":"(VLOOKUP($F421,VegTypeParameters!A:G,6,FALSE))","v":{"$error":"#N/A"}},{"$f":"(VLOOKUP($F421,VegTypeParameters!A:G,7,FALSE))","v":{"$error":"#N/A"}},{"$error":"#N/A"},null,{"$error":"#N/A"},{"$error":"#N/A"},{"$error":"#N/A"},{"$error":"#N/A"},{"$error":"#N/A"},{"$f":"VLOOKUP($F421,VegTypeParameters!$A:$H,8,FALSE)","v":{"$error":"#N/A"}},".",".",".","."]
[6,24,0,0,null,null,null,{"$f":"VLOOKUP(F422,VegTypeParameters!A:G,2,FALSE)","v":{"$error":"#N/A"}},{"$f":"VLOOKUP($F422,VegTypeParameters!$A:$G,5,FALSE)","v":{"$error":"#N/A"}},{"$f":"VLOOKUP($F422,VegTypeParameters!$A:$G,4,FALSE)","v":{"$error":"#N/A"}},{"$f":"G422+FieldBeeForm!$E$11","v":12},{"$error":"#N/A"},{"$f":"(VLOOKUP($F422,VegTypeParameters!A:G,6,FALSE))","v":{"$error":"#N/A"}},{"$f":"(VLOOKUP($F422,VegTypeParameters!A:G,7,FALSE))","v":{"$error":"#N/A"}},{"$error":"#N/A"},null,{"$error":"#N/A"},{"$error":"#N/A"},{"$error":"#N/A"},{"$error":"#N/A"},{"$error":"#N/A"},{"$f":"VLOOKUP($F422,VegTypeParameters!$A:$H,8,FALSE)","v":{"$error":"#N/A"}},".",".",".","."]
[6,25,0,0,null,null,null,{"$f":"VLOOKUP(F423,VegTypeParameters!A:G,2,FALSE)","v":{"$error":"#N/A"}},{"$f":"VLOOKUP($F423,VegTypeParameters!$A:$G,5,FALSE)","v":{"$error":"#N/A"}},{"$f":"VLOOKUP($F423,VegTypeParameters!$A:$G,4,FALSE)","v":{"$error":"#N/A"}},{"$f":"G423+FieldBeeForm!$E$11","v":12},{"$f":"IF(J423>0,J423*(1-EXP(-I423*K423/J423)), 0)","v":{"$error":"#N/A"}},{"$f":"(VLOOKUP($F423,VegTypeParameters!A:G,6,FALSE))","v":{"$error":"#N/A"}},{"$f":"(VLOOKUP($F423,VegTypeParameters!A:G,7,FALSE))","v":{"$error":"#N/A"}},{"$f":"IF(M423>0, (M423*(1-EXP(-N423*G423/M423)))*(M423*(1-EXP(-N423*G423/M423))),0)","v":{"$error":"#N/A"}},null,{"$f":"IF(O423>0, (D423*E423)/O423,0)","v":{"$error":"#N/A"}},{"$f":"IF(M423>0, (M423*(1-EXP(-N423*K423/M423)))*(M423*(1-EXP(-N423*K423/M423))), 0)","v":{"$error":"#N/A"}},{"$f":"IF(M423>0,(M423*(1-EXP(-N423*K423/M423)))*L423,0)","v":{"$error":"#N/A"}},{"$error":"#N/A"},{"$error":"#N/A"},{"$f":"VLOOKUP($F423,VegTypeParameters!$A:$H,8,FALSE)","v":{"$error":"#N/A"}},".",".",".","."]
[6,26,0,0,null,null,null,{"$f":"VLOOKUP(F424,VegTypeParameters!A:G,2,FALSE)","v":{"$error":"#N/A"}},{"$f":"VLOOKUP($F424,VegTypeParameters!$A:$G,5,FALSE)","v":{"$error":"#N/A"}},{"$f":"VLOOKUP($F424,VegTypeParameters!$A:$G,4,FALSE)","v":{"$error":"#N/A"}},{"$f":"G424+FieldBeeForm!$E$11","v":12},{"$f":"IF(J424>0,J424*(1-EXP(-I424*K424/J424)), 0)","v":{"$error":"#N/A"}},{"$f":"(VLOOKUP($F424,VegTypeParameters!A:G,6,FALSE))","v":{"$error":"#N/A"}},{"$f":"(VLOOKUP($F424,VegTypeParameters!A:G,7,FALSE))","v":{"$error":"#N/A"}},{"$f":"IF(M424>0, (M424*(1-EXP(-N424*G424/M424)))*(M424*(1-EXP(-N424*G424/M424))),0)","v":{"$error":"#N/A"}},null,{"$f":"IF(O424>0, (D424*E424)/O424,0)","v":{"$error":"#N/A"}},{"$f":"IF(M424>0, (M424*(1-EXP(-N424*K424/M424)))*(M424*(1-EXP(-N424*K424/M424))), 0)","v":{"$error":"#N/A"}},{"$f":"IF(M424>0,(M424*(1-EXP(-N424*K424/M424)))*L424,0)","v":{"$error":"#N/A"}},{"$error":"#N/A"},{"$error":"#N/A"},{"$f":"VLOOKUP($F424,VegTypeParameters!$A:$H,8,FALSE)","v":{"$error":"#N/A"}},".",".",".","."]
[6,27,0,0,null,null,null,{"$f":"VLOOKUP(F425,VegTypeParameters!A:G,2,FALSE)","v":{"$error":"#N/A"}},{"$f":"VLOOKUP($F425,VegTypeParameters!$A:$G,5,FALSE)","v":{"$error":"#N/A"}},{"$f":"VLOOKUP($F425,VegTypeParameters!$A:$G,4,FALSE)","v":{"$error":"#N/A"}},{"$f":"G425+FieldBeeForm!$E$11","v":12},{"$error":"#N/A"},{"$f":"(VLOOKUP($F425,VegTypeParameters!A:G,6,FALSE))","v":{"$error":"#N/A"}},{"$f":"(VLOOKUP($F425,VegTypeParameters!A:G,7,FALSE))","v":{"$error":"#N/A"}},{"$error":"#N/A"},null,{"$error":"#N/A"},{"$error":"#N/A"},{"$error":"#N/A"},{"$error":"#N/A"},{"$error":"#N/A"},{"$f":"VLOOKUP($F425,VegTypeParameters!$A:$H,8,FALSE)","v":{"$error":"#N/A"}},".",".",".","."]
[6,28,0,0,null,null,null,{"$f":"VLOOKUP(F426,VegTypeParameters!A:G,2,FALSE)","v":{"$error":"#N/A"}},{"$f":"VLOOKUP($F426,VegTypeParameters!$A:$G,5,FALSE)","v":{"$error":"#N/A"}},{"$f":"VLOOKUP($F426,VegTypeParameters!$A:$G,4,FALSE)","v":{"$error":"#N/A"}},{"$f":"G426+FieldBeeForm!$E$11","v":12},{"$error":"#N/A"},{"$f":"(VLOOKUP($F426,VegTypeParameters!A:G,6,FALSE))","v":{"$error":"#N/A"}},{"$f":"(VLOOKUP($F426,VegTypeParameters!A:G,7,FALSE))","v":{"$error":"#N/A"}},{"$error":"#N/A"},null,{"$error":"#N/A"},{"$error":"#N/A"},{"$error":"#N/A"},{"$error":"#N/A"},{"$error":"#N/A"},{"$f":"VLOOKUP($F426,VegTypeParameters!$A:$H,8,FALSE)","v":{"$error":"#N/A"}},".",".",".","."]
[6,29,0,0,null,null,null,{"$f":"VLOOKUP(F427,VegTypeParameters!A:G,2,FALSE)","v":{"$error":"#N/A"}},{"$f":"VLOOKUP($F427,VegTypeParameters!$A:$G,5,FALSE)","v":{"$error":"#N/A"}},{"$f":"VLOOKUP($F427,VegTypeParameters!$A:$G,4,FALSE)","v":{"$error":"#N/A"}},{"$f":"G427+FieldBeeForm!$E$11","v":12},{"$error":"#N/A"},{"$f":"(VLOOKUP($F427,VegTypeParameters!A:G,6,FALSE))","v":{"$error":"#N/A"}},{"$f":"(VLOOKUP($F427,VegTypeParameters!A:G,7,FALSE))","v":{"$error":"#N/A"}},{"$error":"#N/A"},null,{"$error":"#N/A"},{"$error":"#N/A"},{"$error":"#N/A"},{"$error":"#N/A"},{"$error":"#N/A"},{"$f":"VLOOKUP($F427,VegTypeParameters!$A:$H,8,FALSE)","v":{"$error":"#N/A"}},".",".",".","."]
[6,30,0,0,null,null,null,{"$f":"VLOOKUP(F428,VegTypeParameters!A:G,2,FALSE)","v":{"$error":"#N/A"}},{"$f":"VLOOKUP($F428,VegTypeParameters!$A:$G,5,FALSE)","v":{"$error":"#N/A"}},{"$f":"VLOOKUP($F428,VegTypeParameters!$A:$G,4,FALSE)","v":{"$error":"#N/A"}},{"$f":"G428+FieldBeeForm!$E$11","v":12},{"$error":"#N/A"},{"$f":"(VLOOKUP($F428,VegTypeParameters!A:G,6,FALSE))","v":{"$error":"#N/A"}},{"$f":"(VLOOKUP($F428,VegTypeParameters!A:G,7,FALSE))","v":{"$error":"#N/A"}},{"$error":"#N/A"},null,{"$error":"#N/A"},{"$error":"#N/A"},{"$error":"#N/A"},{"$error":"#N/A"},{"$error":"#N/A"},{"$f":"VLOOKUP($F428,VegTypeParameters!$A:$H,8,FALSE)","v":{"$error":"#N/A"}},".",".",".","."]
[6,31,0,0,null,null,null,{"$f":"VLOOKUP(F429,VegTypeParameters!A:G,2,FALSE)","v":{"$error":"#N/A"}},{"$f":"VLOOKUP($F429,VegTypeParameters!$A:$G,5,FALSE)","v":{"$error":"#N/A"}},{"$f":"VLOOKUP($F429,VegTypeParameters!$A:$G,4,FALSE)","v":{"$error":"#N/A"}},{"$f":"G429+FieldBeeForm!$E$11","v":12},{"$error":"#N/A"},{"$f":"(VLOOKUP($F429,VegTypeParameters!A:G,6,FALSE))","v":{"$error":"#N/A"}},{"$f":"(VLOOKUP($F429,VegTypeParameters!A:G,7,FALSE))","v":{"$error":"#N/A"}},{"$error":"#N/A"},null,{"$error":"#N/A"},{"$error":"#N/A"},{"$error":"#N/A"},{"$error":"#N/A"},{"$error":"#N/A"},{"$f":"VLOOKUP($F429,VegTypeParameters!$A:$H,8,FALSE)","v":{"$error":"#N/A"}},".",".",".","."]
[6,32,0,0,null,null,null,{"$f":"VLOOKUP(F430,VegTypeParameters!A:G,2,FALSE)","v":{"$error":"#N/A"}},{"$f":"VLOOKUP($F430,VegTypeParameters!$A:$G,5,FALSE)","v":{"$error":"#N/A"}},{"$f":"VLOOKUP($F430,VegTypeParameters!$A:$G,4,FALSE)","v":{"$error":"#N/A"}},{"$f":"G430+FieldBeeForm!$E$11","v":12},{"$error":"#N/A"},{"$f":"(VLOOKUP($F430,VegTypeParameters!A:G,6,FALSE))","v":{"$error":"#N/A"}},{"$f":"(VLOOKUP($F430,VegTypeParameters!A:G,7,FALSE))","v":{"$error":"#N/A"}},{"$error":"#N/A"},null,{"$error":"#N/A"},{"$error":"#N/A"},{"$error":"#N/A"},{"$error":"#N/A"},{"$error":"#N/A"},{"$f":"VLOOKUP($F430,VegTypeParameters!$A:$H,8,FALSE)","v":{"$error":"#N/A"}},".",".",".","."]
[6,33,0,0,null,null,null,{"$f":"VLOOKUP(F431,VegTypeParameters!A:G,2,FALSE)","v":{"$error":"#N/A"}},{"$f":"VLOOKUP($F431,VegTypeParameters!$A:$G,5,FALSE)","v":{"$error":"#N/A"}},{"$f":"VLOOKUP($F431,VegTypeParameters!$A:$G,4,FALSE)","v":{"$error":"#N/A"}},{"$f":"G431+FieldBeeForm!$E$11","v":12},{"$error":"#N/A"},{"$f":"(VLOOKUP($F431,VegTypeParameters!A:G,6,FALSE))","v":{"$error":"#N/A"}},{"$f":"(VLOOKUP($F431,VegTypeParameters!A:G,7,FALSE))","v":{"$error":"#N/A"}},{"$error":"#N/A"},null,{"$error":"#N/A"},{"$error":"#N/A"},{"$error":"#N/A"},{"$error":"#N/A"},{"$error":"#N/A"},{"$f":"VLOOKUP($F431,VegTypeParameters!$A:$H,8,FALSE)","v":{"$error":"#N/A"}},".",".",".","."]
[6,34,0,0,null,null,null,{"$f":"VLOOKUP(F432,VegTypeParameters!A:G,2,FALSE)","v":{"$error":"#N/A"}},{"$f":"VLOOKUP($F432,VegTypeParameters!$A:$G,5,FALSE)","v":{"$error":"#N/A"}},{"$f":"VLOOKUP($F432,VegTypeParameters!$A:$G,4,FALSE)","v":{"$error":"#N/A"}},{"$f":"G432+FieldBeeForm!$E$11","v":12},{"$error":"#N/A"},{"$f":"(VLOOKUP($F432,VegTypeParameters!A:G,6,FALSE))","v":{"$error":"#N/A"}},{"$f":"(VLOOKUP($F432,VegTypeParameters!A:G,7,FALSE))","v":{"$error":"#N/A"}},{"$error":"#N/A"},null,{"$error":"#N/A"},{"$error":"#N/A"},{"$error":"#N/A"},{"$error":"#N/A"},{"$error":"#N/A"},{"$f":"VLOOKUP($F432,VegTypeParameters!$A:$H,8,FALSE)","v":{"$error":"#N/A"}},".",".",".","."]
[6,35,0,0,null,null,null,{"$f":"VLOOKUP(F433,VegTypeParameters!A:G,2,FALSE)","v":{"$error":"#N/A"}},{"$f":"VLOOKUP($F433,VegTypeParameters!$A:$G,5,FALSE)","v":{"$error":"#N/A"}},{"$f":"VLOOKUP($F433,VegTypeParameters!$A:$G,4,FALSE)","v":{"$error":"#N/A"}},{"$f":"G433+FieldBeeForm!$E$11","v":12},{"$error":"#N/A"},{"$f":"(VLOOKUP($F433,VegTypeParameters!A:G,6,FALSE))","v":{"$error":"#N/A"}},{"$f":"(VLOOKUP($F433,VegTypeParameters!A:G,7,FALSE))","v":{"$error":"#N/A"}},{"$error":"#N/A"},null,{"$error":"#N/A"},{"$error":"#N/A"},{"$error":"#N/A"},{"$error":"#N/A"},{"$error":"#N/A"},{"$f":"VLOOKUP($F433,VegTypeParameters!$A:$H,8,FALSE)","v":{"$error":"#N/A"}},".",".",".","."]
[null,null,null,"Horizontal extent of pollinator plant cover (m2) per season",null,null,null,"Vertical extent of pollinator plant cover (m2) per season",null,null,null,"Number of different pollinator plant species per season"]
["Map Unit #","Vegetation Entry",null,"Spatial extent of Veg Type (m2)","Early","Mid","Late","Spatial extent of Veg Type (m2)","Early","Mid","Late","Early","Mid","Late"]
[{"$f":"A399","v":6},{"$f":"B399","v":1},null,{"$f":"+IF(ISNA(VLOOKUP(B436,B$399:D$433, 3, FALSE)),0,VLOOKUP(B436,B$399:D$433, 3, FALSE))","v":0},{"$f":"+IF(SUMIFS(T$399:T$433, B$399:B$433, $B436, V$399:V$433, \"*\"&\"Early\"&\"*\") <=$D436, SUMIFS(T$399:T$433, B$399:B$433, $B436, V$399:V$433, \"*\"&\"Early\"&\"*\"), $D436)","v":0},{"$f":"+IF(SUMIFS(T$399:T$433,B$399:B$433, $B436, V$399:V$433, \"*\"&\"Mid\"&\"*\") <=$D436, SUMIFS(T$399:T$433,B$399:B$433, $B436, V$399:V$433, \"*\"&\"Mid\"&\"*\"), $D436)","v":0},{"$f":"+IF(SUMIFS(T$399:T$433, B$399:B$433, $B436, $V$399:$V$433, \"*\"&\"Late\"&\"*\") <=$D436, SUMIFS(T$399:T$433,B$399:B$433, $B436,$V$399:$V$433, \"*\"&\"Late\"&\"*\"), $D436)","v":0},{"$f":"+IF(ISNA(VLOOKUP(B436,B$399:D$433, 3, FALSE)),0,VLOOKUP(B436,B$399:D$433, 3, FALSE))","v":0},{"$f":"+IF(SUMIFS($U$399:$U$433, $B$399:$B$433, $B436, $V$399:$V$433, \"*\"&\"Early\"&\"*\") <=$D436, SUMIFS($U$399:$U$433, $B$399:$B$433, $B436, $V$399:$V$433, \"*\"&\"Early\"&\"*\"), $D436)","v":0},{"$f":"+IF(SUMIFS($U$399:$U$433, $B$399:$B$433, $B436, $V$399:$V$433, \"*\"&\"Mid\"&\"*\") <=$D436, SUMIFS($U$399:$U$433, $B$399:$B$433, $B436, $V$399:$V$433, \"*\"&\"Mid\"&\"*\"), $D436)","v":0},{"$f":"+IF(SUMIFS($U$399:$U$433, $B$399:$B$433, $B436, $V$399:$V$433, \"*\"&\"Late\"&\"*\") <=$D436, SUMIFS($U$399:$U$433, $B$399:$B$433, $B436, $V$399:$V$433, \"*\"&\"Late\"&\"*\"), $D436)","v":0}," "]
[{"$f":"A400","v":6},2,null,{"$f":"+IF(ISNA(VLOOKUP(B437,B$399:D$433, 3, FALSE)),0,VLOOKUP(B437,B$399:D$433, 3, FALSE))","v":0},{"$f":"+IF(SUMIFS(T$399:T$433, B$399:B$433, $B437, V$399:V$433, \"*\"&\"Early\"&\"*\") <=$D437, SUMIFS(T$399:T$433, B$399:B$433, $B437, V$399:V$433, \"*\"&\"Early\"&\"*\"), $D437)","v":0},{"$f":"+IF(SUMIFS(T$399:T$433,B$399:B$433, $B437, V$399:V$433, \"*\"&\"Mid\"&\"*\") <=$D437, SUMIFS(T$399:T$433,B$399:B$433, $B437, V$399:V$433, \"*\"&\"Mid\"&\"*\"), $D437)","v":0},{"$f":"+IF(SUMIFS(T$399:T$433, B$399:B$433, $B437, $V$399:$V$433, \"*\"&\"Late\"&\"*\") <=$D437, SUMIFS(T$399:T$433,B$399:B$433, $B437,$V$399:$V$433, \"*\"&\"Late\"&\"*\"), $D437)","v":0},{"$f":"+IF(ISNA(VLOOKUP(B437,B$399:D$433, 3, FALSE)),0,VLOOKUP(B437,B$399:D$433, 3, FALSE))","v":0},{"$f":"+IF(SUMIFS($U$399:$U$433, $B$399:$B$433, $B437, $V$399:$V$433, \"*\"&\"Early\"&\"*\") <=$D437, SUMIFS($U$399:$U$433, $B$399:$B$433, $B437, $V$399:$V$433, \"*\"&\"Early\"&\"*\"), $D437)","v":0},{"$f":"+IF(SUMIFS($U$399:$U$433, $B$399:$B$433, $B437, $V$399:$V$433, \"*\"&\"Mid\"&\"*\") <=$D437, SUMIFS($U$399:$U$433, $B$399:$B$433, $B437, $V$399:$V$433, \"*\"&\"Mid\"&\"*\"), $D437)","v":0},{"$f":"+IF(SUMIFS($U$399:$U$433, $B$399:$B$433, $B437, $V$399:$V$433, \"*\"&\"Late\"&\"*\") <=$D437, SUMIFS($U$399:$U$433, $B$399:$B$433, $B437, $V$399:$V$433, \"*\"&\"Late\"&\"*\"), $D437)","v":0}," "]
[{"$f":"A401","v":6},3,null,0,0,0,0,0,0,0,0]
[{"$f":"A402","v":6},4,null,0,0,0,0,0,0,0,0]
[{"$f":"A403","v":6},5,null,0,0,0,0,0,0,0,0]
[{"$f":"A404","v":6},6,null,0,0,0,0,0,0,0,0]
[{"$f":"A405","v":6},7,null,0,0,0,0,0,0,0,0]
[{"$f":"A406","v":6},8,null,0,0,0,0,0,0,0,0]
[{"$f":"A407","v":6},9,null,0,0,0,0,0,0,0,0]
[{"$f":"A408","v":6},10,null,0,0,0,0,0,0,0,0]
[{"$f":"A409","v":6},11,null,{"$f":"+IF(ISNA(VLOOKUP(B446,B$399:D$433, 3, FALSE)),0,VLOOKUP(B446,B$399:D$433, 3, FALSE))","v":0},{"$f":"+IF(SUMIFS(T$399:T$433, B$399:B$433, $B446, V$399:V$433, \"*\"&\"Early\"&\"*\") <=$D446, SUMIFS(T$399:T$433, B$399:B$433, $B446, V$399:V$433, \"*\"&\"Early\"&\"*\"), $D446)","v":0},{"$f":"+IF(SUMIFS(T$399:T$433,B$399:B$433, $B446, V$399:V$433, \"*\"&\"Mid\"&\"*\") <=$D446, SUMIFS(T$399:T$433,B$399:B$433, $B446, V$399:V$433, \"*\"&\"Mid\"&\"*\"), $D446)","v":0},{"$f":"+IF(SUMIFS(T$399:T$433, B$399:B$433, $B446, $V$399:$V$433, \"*\"&\"Late\"&\"*\") <=$D446, SUMIFS(T$399:T$433,B$399:B$433, $B446,$V$399:$V$433, \"*\"&\"Late\"&\"*\"), $D446)","v":0},{"$f":"+IF(ISNA(VLOOKUP(B446,B$399:D$433, 3, FALSE)),0,VLOOKUP(B446,B$399:D$433, 3, FALSE))","v":0},0,0,0]
[{"$f":"A410","v":6},12,null,0,0,0,0,0,0,0,0]
[{"$f":"A411","v":6},13,null,0,0,0,0,0,0,0,0]
[{"$f":"A412","v":6},14,null,0,0,0,0,0,0,0,0]
[{"$f":"A413","v":6},15,null,0,0,0,0,0,0,0,0]
[{"$f":"A414","v":6},16,null,0,0,0,0,0,0,0,0]
[{"$f":"A415","v":6},17,null,0,0,0,0,0,0,0,0]
[{"$f":"A416","v":6},18,null,0,0,0,0,0,0,0,0]
[{"$f":"A417","v":6},19,null,0,0,0,0,0,0,0,0]
[{"$f":"A418","v":6},20,null,0,0,0,0,0,0,0,0]
[{"$f":"A419","v":6},21,null,0,0,0,0,0,0,0,0]
[{"$f":"A420","v":6},22,null,0,0,0,0,0,0,0,0]
[{"$f":"A421","v":6},23,null,0,0,0,0,0,0,0,0]
[{"$f":"A422","v":6},24,null,0,0,0,0,0,0,0,0]
[{"$f":"A423","v":6},25,null,0,0,0,0,0,0,0,0]
[{"$f":"A424","v":6},26,null,0,0,0,0,0,0,0,0]
[{"$f":"A425","v":6},27,null,0,0,0,0,0,0,0,0]
[{"$f":"A426","v":6},28,null,0,0,0,0,0,0,0,0]
[{"$f":"A427","v":6},29,null,0,0,0,0,0,0,0,0]
[{"$f":"A428","v":6},30,null,0,0,0,0,0,0,0,0]
[{"$f":"A429","v":6},31,null,0,0,0,0,0,0,0,0]
[{"$f":"A430","v":6},32,null,0,0,0,0,0,0,0,0]
[{"$f":"A431","v":6},33,null,0,0,0,0,0,0,0,0]
[{"$f":"A432","v":6},34,null,0,0,0,0,0,0,0,0]
[{"$f":"A433","v":6},35,null,0,0,0,0,0,0,0,0]
[{"$f":"A399","v":6},"Total",null,{"$f":"+SUM(D436:D470)","v":0},{"$f":"+SUM(E436:E470)","v":0},0,0,0,0,0,0,{"$f":"+X398","v":7},{"$f":"+Y398","v":10},{"$f":"+Z398","v":7}]
[null," ",null,{"$f":"D471","v":0},"Map Unit Size in Acres",null,{"$f":"FieldBeeForm!J14","v":20000},"Value entered in FieldBeeForm (Should be same as cell C322)"]
[]
["Enter only in yellow cells. Leave rest untouched.",null,null,null,null,null,"Enter the current year age in column G for each vegetation type. This age will be added to the assessment year (input on Field data form) to determine time series age in column K. If you are interested in just the current effects, enter a '0' in cell E11 of the Field data form."]
["Map Unit","Vegetation Entry","Map Unit Size","Spatial extent of Veg Type","Existing Cover Class for VegType","Species/ VegType","Existing Age of Average Plant \n(for S enter 1, for Sa enter 2, for P enter 3, for M enter 5, for D enter 10)","Species/Vegetation Type Descriptions","Ht Rate","Ht max","Future Age","Future Height","Canopy Width Max (m)","Canopy Width Rate","Existing Age canopy area per plant",null,"Estimated # Individuals","Future Horizontal Surface Area per plant (width x width)","Future Vertical Surface Area per plant (width x height)","Horizontal Surface Area Across Map Unit","Vertical Surface Area Across Map Unit","Season(s)","Season(s) (.)","Early","Mid","Late"]
["#","#"," sq ft","m2","%","code","yrs",null,"m/yr","m","yrs","m","m","m/yr","m2",null,"number","m2","m2","m2","m2",null,null,{"$f":"SUM(IF(FREQUENCY(MATCH(X477:X511, X477:X511,0),MATCH(X477:X511, X477:X511,0))>0,1))-1","v":7},{"$f":"SUM(IF(FREQUENCY(MATCH(Y477:Y511, Y477:Y511,0),MATCH(Y477:Y511, Y477:Y511,0))>0,1))-1","v":10},{"$f":"SUM(IF(FREQUENCY(MATCH(Z477:Z511, Z477:Z511,0),MATCH(Z477:Z511, Z477:Z511,0))>0,1))-1","v":7}]
[7,1,null,{"$f":"(0.092903*C477)*E477","v":0},0.06,1600,5,{"$f":"VLOOKUP(F477,VegTypeParameters!A:G,2,FALSE)","v":"Atriplex"},{"$f":"VLOOKUP($F477,VegTypeParameters!$A:$G,5,FALSE)","v":3.2962962962962963},{"$f":"VLOOKUP($F477,VegTypeParameters!$A:$G,4,FALSE)","v":3},{"$f":"G477+FieldBeeForm!$E$11","v":17},{"$f":"IF(J477>0,J477*(1-EXP(-I477*K477/J477)), 0)","v":2.9999999768298276},{"$f":"(VLOOKUP($F477,VegTypeParameters!A:G,6,FALSE))","v":5},{"$f":"(VLOOKUP($F477,VegTypeParameters!A:G,7,FALSE))","v":7.1111111111111107},{"$f":"IF(M477>0, (M477*(1-EXP(-N477*G477/M477)))*(M477*(1-EXP(-N477*G477/M477))),0)","v":24.959217254150069},null,{"$f":"IF(O477>0, (D477*E477)/O477,0)","v":0},{"$f":"IF(M477>0, (M477*(1-EXP(-N477*K477/M477)))*(M477*(1-EXP(-N477*K477/M477))), 0)","v":24.99999999841986},{"$f":"IF(M477>0,(M477*(1-EXP(-N477*K477/M477)))*L477,0)","v":14.999999883675097},{"$f":"R477*Q477","v":0},{"$f":"S477*Q477","v":0},{"$f":"VLOOKUP($F477,VegTypeParameters!$A:$H,8,FALSE)","v":"Mid/Late"},{"$f":"+IF(ISNA(V477), \".\",  V477)","v":"Mid/Late"},{"$f":"IF($W477=\"Early/Mid\",$H477,IF($W477=\"Early\", $H477, IF($W477=\"Early/Mid/Late\", $H477,\".\")))","v":"."},{"$f":"IF($W477=\"Early/Mid\",$H477,IF($W477=\"Mid\", $H477, IF($W477=\"Mid/Late\", $H477, IF($W477=\"Early/Mid/Late\", $H477,\".\"))))","v":"Atriplex"},{"$f":"IF($W477=\"Mid/Late\",$H477,IF($W477=\"Late\", $H477, IF($W477=\"Early/Mid/Late\", $H477,\".\")))","v":"Atriplex"}]
[7,2,{"$f":"+C$477","v":0},{"$f":"(0.092903*C478)*E478","v":0},0.03,4200,3,{"$f":"VLOOKUP(F478,VegTypeParameters!A:G,2,FALSE)","v":"Helianthus"},{"$f":"VLOOKUP($F478,VegTypeParameters!$A:$G,5,FALSE)","v":6.5},{"$f":"VLOOKUP($F478,VegTypeParameters!$A:$G,4,FALSE)","v":2.5},{"$f":"G478+FieldBeeForm!$E$11","v":15},2.5,{"$f":"(VLOOKUP($F478,VegTypeParameters!A:G,6,FALSE))","v":0.75},{"$f":"(VLOOKUP($F478,VegTypeParameters!A:G,7,FALSE))","v":1.25},0.55494534708652032,null,0,0.56249999998437616,1.8749999999739604,0,0,{"$f":"VLOOKUP($F478,VegTypeParameters!$A:$H,8,FALSE)","v":"Mid/Late"},{"$f":"+IF(ISNA(V478), \".\",  V478)","v":"Mid/Late"},{"$f":"IF($W478=\"Early/Mid\",$H478,IF($W478=\"Early\", $H478, IF($W478=\"Early/Mid/Late\", $H478,\".\")))","v":"."},{"$f":"IF($W478=\"Early/Mid\",$H478,IF($W478=\"Mid\", $H478, IF($W478=\"Mid/Late\", $H478, IF($W478=\"Early/Mid/Late\", $H478,\".\"))))","v":"Helianthus"},{"$f":"IF($W478=\"Mid/Late\",$H478,IF($W478=\"Late\", $H478, IF($W478=\"Early/Mid/Late\", $H478,\".\")))","v":"Helianthus"}]
[7,3,{"$f":"+C$477","v":0},0,0.08,4000,3,{"$f":"VLOOKUP(F479,VegTypeParameters!A:G,2,FALSE)","v":"Grindelia"},{"$f":"VLOOKUP($F479,VegTypeParameters!$A:$G,5,FALSE)","v":1.6666666666666667},{"$f":"VLOOKUP($F479,VegTypeParameters!$A:$G,4,FALSE)","v":2.5},{"$f":"G479+FieldBeeForm!$E$11","v":15},2.4998865001755939,{"$f":"(VLOOKUP($F479,VegTypeParameters!A:G,6,FALSE))","v":2},{"$f":"(VLOOKUP($F479,VegTypeParameters!A:G,7,FALSE))","v":1.3333333333333333},2.9905802896620353,null,0,3.9996368088065144,4.9995460110081433,0,0,{"$f":"VLOOKUP($F479,VegTypeParameters!$A:$H,8,FALSE)","v":"Mid/Late"},"Mid/Late",".","Grindelia","Grindelia"]
[7,4,0,0,0.08,7000,3,{"$f":"VLOOKUP(F480,VegTypeParameters!A:G,2,FALSE)","v":"Salix (shrub)"},{"$f":"VLOOKUP($F480,VegTypeParameters!$A:$G,5,FALSE)","v":0.73},{"$f":"VLOOKUP($F480,VegTypeParameters!$A:$G,4,FALSE)","v":3.5},{"$f":"G480+FieldBeeForm!$E$11","v":15},3.3467689644197414,{"$f":"(VLOOKUP($F480,VegTypeParameters!A:G,6,FALSE))","v":2.5},{"$f":"(VLOOKUP($F480,VegTypeParameters!A:G,7,FALSE))","v":0.55000000000000004},1.4589539561403246,null,0,5.7974627077191743,8.0583238111294335,0,0,{"$f":"VLOOKUP($F480,VegTypeParameters!$A:$H,8,FALSE)","v":"Early"},"Early","Salix (shrub)",".","."]
[7,5,0,0,0.08,8400,5,{"$f":"VLOOKUP(F481,VegTypeParameters!A:G,2,FALSE)","v":"Weeds, non-invasive and not beneficial to pollinators"},{"$f":"VLOOKUP($F481,VegTypeParameters!$A:$G,5,FALSE)","v":0},{"$f":"VLOOKUP($F481,VegTypeParameters!$A:$G,4,FALSE)","v":0},{"$f":"G481+FieldBeeForm!$E$11","v":17},0,{"$f":"(VLOOKUP($F481,VegTypeParameters!A:G,6,FALSE))","v":0},{"$f":"(VLOOKUP($F481,VegTypeParameters!A:G,7,FALSE))","v":0},0,null,0,0,0,0,0,{"$f":"VLOOKUP($F481,VegTypeParameters!$A:$H,8,FALSE)","v":"Never"},"Never",".",".","."]
[7,6,0,0,0.08,5300,3,{"$f":"VLOOKUP(F482,VegTypeParameters!A:G,2,FALSE)","v":"Medicago "},{"$f":"VLOOKUP($F482,VegTypeParameters!$A:$G,5,FALSE)","v":0.5},{"$f":"VLOOKUP($F482,VegTypeParameters!$A:$G,4,FALSE)","v":0.5},{"$f":"G482+FieldBeeForm!$E$11","v":15},0.49999984704883976,{"$f":"(VLOOKUP($F482,VegTypeParameters!A:G,6,FALSE))","v":0.7},{"$f":"(VLOOKUP($F482,VegTypeParameters!A:G,7,FALSE))","v":0.7},0.44242326156605982,null,0,0.48999970021577172,0.34999978586840841,0,0,{"$f":"VLOOKUP($F482,VegTypeParameters!$A:$H,8,FALSE)","v":"Mid/Late"},"Mid/Late",".","Medicago ","Medicago "]
[7,7,0,0,0.08,1600,3,{"$f":"VLOOKUP(F483,VegTypeParameters!A:G,2,FALSE)","v":"Atriplex"},{"$f":"VLOOKUP($F483,VegTypeParameters!$A:$G,5,FALSE)","v":3.2962962962962963},{"$f":"VLOOKUP($F483,VegTypeParameters!$A:$G,4,FALSE)","v":3},{"$f":"G483+FieldBeeForm!$E$11","v":15},2.999999791404568,{"$f":"(VLOOKUP($F483,VegTypeParameters!A:G,6,FALSE))","v":5},{"$f":"(VLOOKUP($F483,VegTypeParameters!A:G,7,FALSE))","v":7.1111111111111107},24.303496604054391,null,0,24.999999972834292,14.999998948873127,0,0,{"$f":"VLOOKUP($F483,VegTypeParameters!$A:$H,8,FALSE)","v":"Mid/Late"},"Mid/Late",".","Atriplex","Atriplex"]
[7,8,0,0,0.03,7500,3,{"$f":"VLOOKUP(F484,VegTypeParameters!A:G,2,FALSE)","v":"Scrophularia"},{"$f":"VLOOKUP($F484,VegTypeParameters!$A:$G,5,FALSE)","v":1.2},{"$f":"VLOOKUP($F484,VegTypeParameters!$A:$G,4,FALSE)","v":1.2},{"$f":"G484+FieldBeeForm!$E$11","v":15},1.1999996329172153,{"$f":"(VLOOKUP($F484,VegTypeParameters!A:G,6,FALSE))","v":0.3},{"$f":"(VLOOKUP($F484,VegTypeParameters!A:G,7,FALSE))","v":0.3},8.1261415389684455E-2,null,0,8.9999944937590726E-2,0.3599997797503629,0,0,{"$f":"VLOOKUP($F484,VegTypeParameters!$A:$H,8,FALSE)","v":"Early/Mid"},"Early/Mid","Scrophularia","Scrophularia","."]
[7,9,0,0,0.03,3500,3,{"$f":"VLOOKUP(F485,VegTypeParameters!A:G,2,FALSE)","v":"Ficus carica"},{"$f":"VLOOKUP($F485,VegTypeParameters!$A:$G,5,FALSE)","v":0},{"$f":"VLOOKUP($F485,VegTypeParameters!$A:$G,4,FALSE)","v":0},{"$f":"G485+FieldBeeForm!$E$11","v":15},0,{"$f":"(VLOOKUP($F485,VegTypeParameters!A:G,6,FALSE))","v":0},{"$f":"(VLOOKUP($F485,VegTypeParameters!A:G,7,FALSE))","v":0},0,null,0,0,0,0,0,{"$f":"VLOOKUP($F485,VegTypeParameters!$A:$H,8,FALSE)","v":"Never"},"Never",".",".","."]
[7,10,0,0,0.03,6200,3,{"$f":"VLOOKUP(F486,VegTypeParameters!A:G,2,FALSE)","v":"Other late blooming native plants beneficial to pollinators"},{"$f":"VLOOKUP($F486,VegTypeParameters!$A:$G,5,FALSE)","v":0.25},{"$f":"VLOOKUP($F486,VegTypeParameters!$A:$G,4,FALSE)","v":1},{"$f":"G486+FieldBeeForm!$E$11","v":15},0.97648225414399092,{"$f":"(VLOOKUP($F486,VegTypeParameters!A:G,6,FALSE))","v":0.5},{"$f":"(VLOOKUP($F486,VegTypeParameters!A:G,7,FALSE))","v":0.25},0.15088168701775109,null,0,0.24972353429050623,0.48797108853574861,0,0,{"$f":"VLOOKUP($F486,VegTypeParameters!$A:$H,8,FALSE)","v":"Late"},"Late",".",".","Other late blooming native plants beneficial to pollinators"]
[7,11,0,0,0.03,2500,3,{"$f":"VLOOKUP(F487,VegTypeParameters!A:G,2,FALSE)","v":"Clarkia"},{"$f":"VLOOKUP($F487,VegTypeParameters!$A:$G,5,FALSE)","v":0.4},{"$f":"VLOOKUP($F487,VegTypeParameters!$A:$G,4,FALSE)","v":0.4},{"$f":"G487+FieldBeeForm!$E$11","v":15},0.39999987763907185,{"$f":"(VLOOKUP($F487,VegTypeParameters!A:G,6,FALSE))","v":0.1},{"$f":"(VLOOKUP($F487,VegTypeParameters!A:G,7,FALSE))","v":0.1},9.029046154409387E-3,null,0,9.9999938819545289E-3,3.9999975527818116E-2,0,0,{"$f":"VLOOKUP($F487,VegTypeParameters!$A:$H,8,FALSE)","v":"Early/Mid"},"Early/Mid","Clarkia","Clarkia","."]
[7,12,0,0,0.08,5000,3,{"$f":"VLOOKUP(F488,VegTypeParameters!A:G,2,FALSE)","v":"Lupinus spp."},{"$f":"VLOOKUP($F488,VegTypeParameters!$A:$G,5,FALSE)","v":0.98000000000000009},{"$f":"VLOOKUP($F488,VegTypeParameters!$A:$G,4,FALSE)","v":3},{"$f":"G488+FieldBeeForm!$E$11","v":15},2.9776602507872267,{"$f":"(VLOOKUP($F488,VegTypeParameters!A:G,6,FALSE))","v":3},{"$f":"(VLOOKUP($F488,VegTypeParameters!A:G,7,FALSE))","v":1.08},3.925206627733659,null,0,8.9188851385636738,8.8926342217348378,0,0,{"$f":"VLOOKUP($F488,VegTypeParameters!$A:$H,8,FALSE)","v":"Early/Mid/Late"},"Early/Mid/Late","Lupinus spp.","Lupinus spp.","Lupinus spp."]
[7,13,0,0,0.08,6000,3,{"$f":"VLOOKUP(F489,VegTypeParameters!A:G,2,FALSE)","v":"Orchard"},{"$f":"VLOOKUP($F489,VegTypeParameters!$A:$G,5,FALSE)","v":0.5},{"$f":"VLOOKUP($F489,VegTypeParameters!$A:$G,4,FALSE)","v":10},{"$f":"G489+FieldBeeForm!$E$11","v":15},5.2763344725898529,{"$f":"(VLOOKUP($F489,VegTypeParameters!A:G,6,FALSE))","v":6},{"$f":"(VLOOKUP($F489,VegTypeParameters!A:G,7,FALSE))","v":0.5},1.7614473685136525,null,0,18.326714576526665,22.58783601812447,0,0,{"$f":"VLOOKUP($F489,VegTypeParameters!$A:$H,8,FALSE)","v":"Early"},"Early","Orchard",".","."]
[7,14,0,0,0.03,3300,5,{"$f":"VLOOKUP(F490,VegTypeParameters!A:G,2,FALSE)","v":"Eschscholzia"},{"$f":"VLOOKUP($F490,VegTypeParameters!$A:$G,5,FALSE)","v":0.6},{"$f":"VLOOKUP($F490,VegTypeParameters!$A:$G,4,FALSE)","v":0.3},{"$f":"G490+FieldBeeForm!$E$11","v":17},0.29999999999999949,{"$f":"(VLOOKUP($F490,VegTypeParameters!A:G,6,FALSE))","v":0.15},{"$f":"(VLOOKUP($F490,VegTypeParameters!A:G,7,FALSE))","v":0.3},2.2497957049536645E-2,null,0,2.2499999999999923E-2,4.4999999999999846E-2,0,0,{"$f":"VLOOKUP($F490,VegTypeParameters!$A:$H,8,FALSE)","v":"Early/Mid"},"Early/Mid","Eschscholzia","Eschscholzia","."]
[7,15,0,0,0.03,5600,3,{"$f":"VLOOKUP(F491,VegTypeParameters!A:G,2,FALSE)","v":"Native forbs and graminoids not beneficial to pollinators"},{"$f":"VLOOKUP($F491,VegTypeParameters!$A:$G,5,FALSE)","v":0},{"$f":"VLOOKUP($F491,VegTypeParameters!$A:$G,4,FALSE)","v":0},{"$f":"G491+FieldBeeForm!$E$11","v":15},{"$f":"IF(J491>0,J491*(1-EXP(-I491*K491/J491)), 0)","v":0},{"$f":"(VLOOKUP($F491,VegTypeParameters!A:G,6,FALSE))","v":0},{"$f":"(VLOOKUP($F491,VegTypeParameters!A:G,7,FALSE))","v":0},{"$f":"IF(M491>0, (M491*(1-EXP(-N491*G491/M491)))*(M491*(1-EXP(-N491*G491/M491))),0)","v":0},null,{"$f":"IF(O491>0, (D491*E491)/O491,0)","v":0},{"$f":"IF(M491>0, (M491*(1-EXP(-N491*K491/M491)))*(M491*(1-EXP(-N491*K491/M491))), 0)","v":0},{"$f":"IF(M491>0,(M491*(1-EXP(-N491*K491/M491)))*L491,0)","v":0},0,0,{"$f":"VLOOKUP($F491,VegTypeParameters!$A:$H,8,FALSE)","v":"Never"},"Never",".",".","."]
[7,16,0,0,0.08,3800,3,{"$f":"VLOOKUP(F492,VegTypeParameters!A:G,2,FALSE)","v":"Gilia"},{"$f":"VLOOKUP($F492,VegTypeParameters!$A:$G,5,FALSE)","v":0.6},{"$f":"VLOOKUP($F492,VegTypeParameters!$A:$G,4,FALSE)","v":0.3},{"$f":"G492+FieldBeeForm!$E$11","v":15},{"$f":"IF(J492>0,J492*(1-EXP(-I492*K492/J492)), 0)","v":0.2999999999999719},{"$f":"(VLOOKUP($F492,VegTypeParameters!A:G,6,FALSE))","v":0.15},{"$f":"(VLOOKUP($F492,VegTypeParameters!A:G,7,FALSE))","v":0.3},{"$f":"IF(M492>0, (M492*(1-EXP(-N492*G492/M492)))*(M492*(1-EXP(-N492*G492/M492))),0)","v":2.2388594396827964E-2},null,{"$f":"IF(O492>0, (D492*E492)/O492,0)","v":0},{"$f":"IF(M492>0, (M492*(1-EXP(-N492*K492/M492)))*(M492*(1-EXP(-N492*K492/M492))), 0)","v":2.2499999999995784E-2},{"$f":"IF(M492>0,(M492*(1-EXP(-N492*K492/M492)))*L492,0)","v":4.4999999999991568E-2},0,0,{"$f":"VLOOKUP($F492,VegTypeParameters!$A:$H,8,FALSE)","v":"Mid"},"Mid",".","Gilia","."]
[7,17,0,0,0.08,1500,3,{"$f":"VLOOKUP(F493,VegTypeParameters!A:G,2,FALSE)","v":"Asclepias"},{"$f":"VLOOKUP($F493,VegTypeParameters!$A:$G,5,FALSE)","v":0.8},{"$f":"VLOOKUP($F493,VegTypeParameters!$A:$G,4,FALSE)","v":0.8},{"$f":"G493+FieldBeeForm!$E$11","v":15},0.79999975527814371,{"$f":"(VLOOKUP($F493,VegTypeParameters!A:G,6,FALSE))","v":0.2},{"$f":"(VLOOKUP($F493,VegTypeParameters!A:G,7,FALSE))","v":0.2},3.6116184617637548E-2,null,0,3.9999975527818116E-2,0.15999990211127246,0,0,{"$f":"VLOOKUP($F493,VegTypeParameters!$A:$H,8,FALSE)","v":"Early/Mid/Late"},"Early/Mid/Late","Asclepias","Asclepias","Asclepias"]
[7,18,0,0,5.0000000000000001E-3,1600,1,{"$f":"VLOOKUP(F494,VegTypeParameters!A:G,2,FALSE)","v":"Atriplex"},{"$f":"VLOOKUP($F494,VegTypeParameters!$A:$G,5,FALSE)","v":3.2962962962962963},{"$f":"VLOOKUP($F494,VegTypeParameters!$A:$G,4,FALSE)","v":3},{"$f":"G494+FieldBeeForm!$E$11","v":13},2.9999981220660135,{"$f":"(VLOOKUP($F494,VegTypeParameters!A:G,6,FALSE))","v":5},{"$f":"(VLOOKUP($F494,VegTypeParameters!A:G,7,FALSE))","v":7.1111111111111107},14.395290762184326,null,0,24.999999532966985,14.999990470220251,0,0,{"$f":"VLOOKUP($F494,VegTypeParameters!$A:$H,8,FALSE)","v":"Mid/Late"},"Mid/Late",".","Atriplex","Atriplex"]
[7,19,0,0,null,null,null,{"$f":"VLOOKUP(F495,VegTypeParameters!A:G,2,FALSE)","v":{"$error":"#N/A"}},{"$f":"VLOOKUP($F495,VegTypeParameters!$A:$G,5,FALSE)","v":{"$error":"#N/A"}},{"$f":"VLOOKUP($F495,VegTypeParameters!$A:$G,4,FALSE)","v":{"$error":"#N/A"}},{"$f":"G495+FieldBeeForm!$E$11","v":12},{"$error":"#N/A"},{"$f":"(VLOOKUP($F495,VegTypeParameters!A:G,6,FALSE))","v":{"$error":"#N/A"}},{"$f":"(VLOOKUP($F495,VegTypeParameters!A:G,7,FALSE))","v":{"$error":"#N/A"}},{"$error":"#N/A"},null,{"$error":"#N/A"},{"$error":"#N/A"},{"$error":"#N/A"},{"$error":"#N/A"},{"$error":"#N/A"},{"$f":"VLOOKUP($F495,VegTypeParameters!$A:$H,8,FALSE)","v":{"$error":"#N/A"}},".",".",".","."]
[7,20,0,0,null,null,null,{"$f":"VLOOKUP(F496,VegTypeParameters!A:G,2,FALSE)","v":{"$error":"#N/A"}},{"$f":"VLOOKUP($F496,VegTypeParameters!$A:$G,5,FALSE)","v":{"$error":"#N/A"}},{"$f":"VLOOKUP($F496,VegTypeParameters!$A:$G,4,FALSE)","v":{"$error":"#N/A"}},{"$f":"G496+FieldBeeForm!$E$11","v":12},{"$error":"#N/A"},{"$f":"(VLOOKUP($F496,VegTypeParameters!A:G,6,FALSE))","v":{"$error":"#N/A"}},{"$f":"(VLOOKUP($F496,VegTypeParameters!A:G,7,FALSE))","v":{"$error":"#N/A"}},{"$error":"#N/A"},null,{"$error":"#N/A"},{"$error":"#N/A"},{"$error":"#N/A"},{"$error":"#N/A"},{"$error":"#N/A"},{"$f":"VLOOKUP($F496,VegTypeParameters!$A:$H,8,FALSE)","v":{"$error":"#N/A"}},".",".",".","."]
[7,21,0,0,null,null,null,{"$f":"VLOOKUP(F497,VegTypeParameters!A:G,2,FALSE)","v":{"$error":"#N/A"}},{"$f":"VLOOKUP($F497,VegTypeParameters!$A:$G,5,FALSE)","v":{"$error":"#N/A"}},{"$f":"VLOOKUP($F497,VegTypeParameters!$A:$G,4,FALSE)","v":{"$error":"#N/A"}},{"$f":"G497+FieldBeeForm!$E$11","v":12},{"$error":"#N/A"},{"$f":"(VLOOKUP($F497,VegTypeParameters!A:G,6,FALSE))","v":{"$error":"#N/A"}},{"$f":"(VLOOKUP($F497,VegTypeParameters!A:G,7,FALSE))","v":{"$error":"#N/A"}},{"$error":"#N/A"},null,{"$error":"#N/A"},{"$error":"#N/A"},{"$error":"#N/A"},{"$error":"#N/A"},{"$error":"#N/A"},{"$f":"VLOOKUP($F497,VegTypeParameters!$A:$H,8,FALSE)","v":{"$error":"#N/A"}},".",".",".","."]
[7,22,0,0,null,null,null,{"$f":"VLOOKUP(F498,VegTypeParameters!A:G,2,FALSE)","v":{"$error":"#N/A"}},{"$f":"VLOOKUP($F498,VegTypeParameters!$A:$G,5,FALSE)","v":{"$error":"#N/A"}},{"$f":"VLOOKUP($F498,VegTypeParameters!$A:$G,4,FALSE)","v":{"$error":"#N/A"}},{"$f":"G498+FieldBeeForm!$E$11","v":12},{"$error":"#N/A"},{"$f":"(VLOOKUP($F498,VegTypeParameters!A:G,6,FALSE))","v":{"$error":"#N/A"}},{"$f":"(VLOOKUP($F498,VegTypeParameters!A:G,7,FALSE))","v":{"$error":"#N/A"}},{"$error":"#N/A"},null,{"$error":"#N/A"},{"$error":"#N/A"},{"$error":"#N/A"},{"$error":"#N/A"},{"$error":"#N/A"},{"$f":"VLOOKUP($F498,VegTypeParameters!$A:$H,8,FALSE)","v":{"$error":"#N/A"}},".",".",".","."]
[7,23,0,0,null,null,null,{"$f":"VLOOKUP(F499,VegTypeParameters!A:G,2,FALSE)","v":{"$error":"#N/A"}},{"$f":"VLOOKUP($F499,VegTypeParameters!$A:$G,5,FALSE)","v":{"$error":"#N/A"}},{"$f":"VLOOKUP($F499,VegTypeParameters!$A:$G,4,FALSE)","v":{"$error":"#N/A"}},{"$f":"G499+FieldBeeForm!$E$11","v":12},{"$error":"#N/A"},{"$f":"(VLOOKUP($F499,VegTypeParameters!A:G,6,FALSE))","v":{"$error":"#N/A"}},{"$f":"(VLOOKUP($F499,VegTypeParameters!A:G,7,FALSE))","v":{"$error":"#N/A"}},{"$error":"#N/A"},null,{"$error":"#N/A"},{"$error":"#N/A"},{"$error":"#N/A"},{"$error":"#N/A"},{"$error":"#N/A"},{"$f":"VLOOKUP($F499,VegTypeParameters!$A:$H,8,FALSE)","v":{"$error":"#N/A"}},".",".",".","."]
[7,24,0,0,null,null,null,{"$f":"VLOOKUP(F500,VegTypeParameters!A:G,2,FALSE)","v":{"$error":"#N/A"}},{"$f":"VLOOKUP($F500,VegTypeParameters!$A:$G,5,FALSE)","v":{"$error":"#N/A"}},{"$f":"VLOOKUP($F500,VegTypeParameters!$A:$G,4,FALSE)","v":{"$error":"#N/A"}},{"$f":"G500+FieldBeeForm!$E$11","v":12},{"$error":"#N/A"},{"$f":"(VLOOKUP($F500,VegTypeParameters!A:G,6,FALSE))","v":{"$error":"#N/A"}},{"$f":"(VLOOKUP($F500,VegTypeParameters!A:G,7,FALSE))","v":{"$error":"#N/A"}},{"$error":"#N/A"},null,{"$error":"#N/A"},{"$error":"#N/A"},{"$error":"#N/A"},{"$error":"#N/A"},{"$error":"#N/A"},{"$f":"VLOOKUP($F500,VegTypeParameters!$A:$H,8,FALSE)","v":{"$error":"#N/A"}},".",".",".","."]
[7,25,0,0,null,null,null,{"$f":"VLOOKUP(F501,VegTypeParameters!A:G,2,FALSE)","v":{"$error":"#N/A"}},{"$f":"VLOOKUP($F501,VegTypeParameters!$A:$G,5,FALSE)","v":{"$error":"#N/A"}},{"$f":"VLOOKUP($F501,VegTypeParameters!$A:$G,4,FALSE)","v":{"$error":"#N/A"}},{"$f":"G501+FieldBeeForm!$E$11","v":12},{"$f":"IF(J501>0,J501*(1-EXP(-I501*K501/J501)), 0)","v":{"$error":"#N/A"}},{"$f":"(VLOOKUP($F501,VegTypeParameters!A:G,6,FALSE))","v":{"$error":"#N/A"}},{"$f":"(VLOOKUP($F501,VegTypeParameters!A:G,7,FALSE))","v":{"$error":"#N/A"}},{"$f":"IF(M501>0, (M501*(1-EXP(-N501*G501/M501)))*(M501*(1-EXP(-N501*G501/M501))),0)","v":{"$error":"#N/A"}},null,{"$f":"IF(O501>0, (D501*E501)/O501,0)","v":{"$error":"#N/A"}},{"$f":"IF(M501>0, (M501*(1-EXP(-N501*K501/M501)))*(M501*(1-EXP(-N501*K501/M501))), 0)","v":{"$error":"#N/A"}},{"$f":"IF(M501>0,(M501*(1-EXP(-N501*K501/M501)))*L501,0)","v":{"$error":"#N/A"}},{"$error":"#N/A"},{"$error":"#N/A"},{"$f":"VLOOKUP($F501,VegTypeParameters!$A:$H,8,FALSE)","v":{"$error":"#N/A"}},".",".",".","."]
[7,26,0,0,null,null,null,{"$f":"VLOOKUP(F502,VegTypeParameters!A:G,2,FALSE)","v":{"$error":"#N/A"}},{"$f":"VLOOKUP($F502,VegTypeParameters!$A:$G,5,FALSE)","v":{"$error":"#N/A"}},{"$f":"VLOOKUP($F502,VegTypeParameters!$A:$G,4,FALSE)","v":{"$error":"#N/A"}},{"$f":"G502+FieldBeeForm!$E$11","v":12},{"$f":"IF(J502>0,J502*(1-EXP(-I502*K502/J502)), 0)","v":{"$error":"#N/A"}},{"$f":"(VLOOKUP($F502,VegTypeParameters!A:G,6,FALSE))","v":{"$error":"#N/A"}},{"$f":"(VLOOKUP($F502,VegTypeParameters!A:G,7,FALSE))","v":{"$error":"#N/A"}},{"$f":"IF(M502>0, (M502*(1-EXP(-N502*G502/M502)))*(M502*(1-EXP(-N502*G502/M502))),0)","v":{"$error":"#N/A"}},null,{"$f":"IF(O502>0, (D502*E502)/O502,0)","v":{"$error":"#N/A"}},{"$f":"IF(M502>0, (M502*(1-EXP(-N502*K502/M502)))*(M502*(1-EXP(-N502*K502/M502))), 0)","v":{"$error":"#N/A"}},{"$f":"IF(M502>0,(M502*(1-EXP(-N502*K502/M502)))*L502,0)","v":{"$error":"#N/A"}},{"$error":"#N/A"},{"$error":"#N/A"},{"$f":"VLOOKUP($F502,VegTypeParameters!$A:$H,8,FALSE)","v":{"$error":"#N/A"}},".",".",".","."]
[7,27,0,0,null,null,null,{"$f":"VLOOKUP(F503,VegTypeParameters!A:G,2,FALSE)","v":{"$error":"#N/A"}},{"$f":"VLOOKUP($F503,VegTypeParameters!$A:$G,5,FALSE)","v":{"$error":"#N/A"}},{"$f":"VLOOKUP($F503,VegTypeParameters!$A:$G,4,FALSE)","v":{"$error":"#N/A"}},{"$f":"G503+FieldBeeForm!$E$11","v":12},{"$error":"#N/A"},{"$f":"(VLOOKUP($F503,VegTypeParameters!A:G,6,FALSE))","v":{"$error":"#N/A"}},{"$f":"(VLOOKUP($F503,VegTypeParameters!A:G,7,FALSE))","v":{"$error":"#N/A"}},{"$error":"#N/A"},null,{"$error":"#N/A"},{"$error":"#N/A"},{"$error":"#N/A"},{"$error":"#N/A"},{"$error":"#N/A"},{"$f":"VLOOKUP($F503,VegTypeParameters!$A:$H,8,FALSE)","v":{"$error":"#N/A"}},".",".",".","."]
[7,28,0,0,null,null,null,{"$f":"VLOOKUP(F504,VegTypeParameters!A:G,2,FALSE)","v":{"$error":"#N/A"}},{"$f":"VLOOKUP($F504,VegTypeParameters!$A:$G,5,FALSE)","v":{"$error":"#N/A"}},{"$f":"VLOOKUP($F504,VegTypeParameters!$A:$G,4,FALSE)","v":{"$error":"#N/A"}},{"$f":"G504+FieldBeeForm!$E$11","v":12},{"$error":"#N/A"},{"$f":"(VLOOKUP($F504,VegTypeParameters!A:G,6,FALSE))","v":{"$error":"#N/A"}},{"$f":"(VLOOKUP($F504,VegTypeParameters!A:G,7,FALSE))","v":{"$error":"#N/A"}},{"$error":"#N/A"},null,{"$error":"#N/A"},{"$error":"#N/A"},{"$error":"#N/A"},{"$error":"#N/A"},{"$error":"#N/A"},{"$f":"VLOOKUP($F504,VegTypeParameters!$A:$H,8,FALSE)","v":{"$error":"#N/A"}},".",".",".","."]
[7,29,0,0,null,null,null,{"$f":"VLOOKUP(F505,VegTypeParameters!A:G,2,FALSE)","v":{"$error":"#N/A"}},{"$f":"VLOOKUP($F505,VegTypeParameters!$A:$G,5,FALSE)","v":{"$error":"#N/A"}},{"$f":"VLOOKUP($F505,VegTypeParameters!$A:$G,4,FALSE)","v":{"$error":"#N/A"}},{"$f":"G505+FieldBeeForm!$E$11","v":12},{"$error":"#N/A"},{"$f":"(VLOOKUP($F505,VegTypeParameters!A:G,6,FALSE))","v":{"$error":"#N/A"}},{"$f":"(VLOOKUP($F505,VegTypeParameters!A:G,7,FALSE))","v":{"$error":"#N/A"}},{"$error":"#N/A"},null,{"$error":"#N/A"},{"$error":"#N/A"},{"$error":"#N/A"},{"$error":"#N/A"},{"$error":"#N/A"},{"$f":"VLOOKUP($F505,VegTypeParameters!$A:$H,8,FALSE)","v":{"$error":"#N/A"}},".",".",".","."]
[7,30,0,0,null,null,null,{"$f":"VLOOKUP(F506,VegTypeParameters!A:G,2,FALSE)","v":{"$error":"#N/A"}},{"$f":"VLOOKUP($F506,VegTypeParameters!$A:$G,5,FALSE)","v":{"$error":"#N/A"}},{"$f":"VLOOKUP($F506,VegTypeParameters!$A:$G,4,FALSE)","v":{"$error":"#N/A"}},{"$f":"G506+FieldBeeForm!$E$11","v":12},{"$error":"#N/A"},{"$f":"(VLOOKUP($F506,VegTypeParameters!A:G,6,FALSE))","v":{"$error":"#N/A"}},{"$f":"(VLOOKUP($F506,VegTypeParameters!A:G,7,FALSE))","v":{"$error":"#N/A"}},{"$error":"#N/A"},null,{"$error":"#N/A"},{"$error":"#N/A"},{"$error":"#N/A"},{"$error":"#N/A"},{"$error":"#N/A"},{"$f":"VLOOKUP($F506,VegTypeParameters!$A:$H,8,FALSE)","v":{"$error":"#N/A"}},".",".",".","."]
[7,31,0,0,null,null,null,{"$f":"VLOOKUP(F507,VegTypeParameters!A:G,2,FALSE)","v":{"$error":"#N/A"}},{"$f":"VLOOKUP($F507,VegTypeParameters!$A:$G,5,FALSE)","v":{"$error":"#N/A"}},{"$f":"VLOOKUP($F507,VegTypeParameters!$A:$G,4,FALSE)","v":{"$error":"#N/A"}},{"$f":"G507+FieldBeeForm!$E$11","v":12},{"$error":"#N/A"},{"$f":"(VLOOKUP($F507,VegTypeParameters!A:G,6,FALSE))","v":{"$error":"#N/A"}},{"$f":"(VLOOKUP($F507,VegTypeParameters!A:G,7,FALSE))","v":{"$error":"#N/A"}},{"$error":"#N/A"},null,{"$error":"#N/A"},{"$error":"#N/A"},{"$error":"#N/A"},{"$error":"#N/A"},{"$error":"#N/A"},{"$f":"VLOOKUP($F507,VegTypeParameters!$A:$H,8,FALSE)","v":{"$error":"#N/A"}},".",".",".","."]
[7,32,0,0,null,null,null,{"$f":"VLOOKUP(F508,VegTypeParameters!A:G,2,FALSE)","v":{"$error":"#N/A"}},{"$f":"VLOOKUP($F508,VegTypeParameters!$A:$G,5,FALSE)","v":{"$error":"#N/A"}},{"$f":"VLOOKUP($F508,VegTypeParameters!$A:$G,4,FALSE)","v":{"$error":"#N/A"}},{"$f":"G508+FieldBeeForm!$E$11","v":12},{"$error":"#N/A"},{"$f":"(VLOOKUP($F508,VegTypeParameters!A:G,6,FALSE))","v":{"$error":"#N/A"}},{"$f":"(VLOOKUP($F508,VegTypeParameters!A:G,7,FALSE))","v":{"$error":"#N/A"}},{"$error":"#N/A"},null,{"$error":"#N/A"},{"$error":"#N/A"},{"$error":"#N/A"},{"$error":"#N/A"},{"$error":"#N/A"},{"$f":"VLOOKUP($F508,VegTypeParameters!$A:$H,8,FALSE)","v":{"$error":"#N/A"}},".",".",".","."]
[7,33,0,0,null,null,null,{"$f":"VLOOKUP(F509,VegTypeParameters!A:G,2,FALSE)","v":{"$error":"#N/A"}},{"$f":"VLOOKUP($F509,VegTypeParameters!$A:$G,5,FALSE)","v":{"$error":"#N/A"}},{"$f":"VLOOKUP($F509,VegTypeParameters!$A:$G,4,FALSE)","v":{"$error":"#N/A"}},{"$f":"G509+FieldBeeForm!$E$11","v":12},{"$error":"#N/A"},{"$f":"(VLOOKUP($F509,VegTypeParameters!A:G,6,FALSE))","v":{"$error":"#N/A"}},{"$f":"(VLOOKUP($F509,VegTypeParameters!A:G,7,FALSE))","v":{"$error":"#N/A"}},{"$error":"#N/A"},null,{"$error":"#N/A"},{"$error":"#N/A"},{"$error":"#N/A"},{"$error":"#N/A"},{"$error":"#N/A"},{"$f":"VLOOKUP($F509,VegTypeParameters!$A:$H,8,FALSE)","v":{"$error":"#N/A"}},".",".",".","."]
[7,34,0,0,null,null,null,{"$f":"VLOOKUP(F510,VegTypeParameters!A:G,2,FALSE)","v":{"$error":"#N/A"}},{"$f":"VLOOKUP($F510,VegTypeParameters!$A:$G,5,FALSE)","v":{"$error":"#N/A"}},{"$f":"VLOOKUP($F510,VegTypeParameters!$A:$G,4,FALSE)","v":{"$error":"#N/A"}},{"$f":"G510+FieldBeeForm!$E$11","v":12},{"$error":"#N/A"},{"$f":"(VLOOKUP($F510,VegTypeParameters!A:G,6,FALSE))","v":{"$error":"#N/A"}},{"$f":"(VLOOKUP($F510,VegTypeParameters!A:G,7,FALSE))","v":{"$error":"#N/A"}},{"$error":"#N/A"},null,{"$error":"#N/A"},{"$error":"#N/A"},{"$error":"#N/A"},{"$error":"#N/A"},{"$error":"#N/A"},{"$f":"VLOOKUP($F510,VegTypeParameters!$A:$H,8,FALSE)","v":{"$error":"#N/A"}},".",".",".","."]
[7,35,0,0,null,null,null,{"$f":"VLOOKUP(F511,VegTypeParameters!A:G,2,FALSE)","v":{"$error":"#N/A"}},{"$f":"VLOOKUP($F511,VegTypeParameters!$A:$G,5,FALSE)","v":{"$error":"#N/A"}},{"$f":"VLOOKUP($F511,VegTypeParameters!$A:$G,4,FALSE)","v":{"$error":"#N/A"}},{"$f":"G511+FieldBeeForm!$E$11","v":12},{"$error":"#N/A"},{"$f":"(VLOOKUP($F511,VegTypeParameters!A:G,6,FALSE))","v":{"$error":"#N/A"}},{"$f":"(VLOOKUP($F511,VegTypeParameters!A:G,7,FALSE))","v":{"$error":"#N/A"}},{"$error":"#N/A"},null,{"$error":"#N/A"},{"$error":"#N/A"},{"$error":"#N/A"},{"$error":"#N/A"},{"$error":"#N/A"},{"$f":"VLOOKUP($F511,VegTypeParameters!$A:$H,8,FALSE)","v":{"$error":"#N/A"}},".",".",".","."]
[null,null,null,"Horizontal extent of pollinator plant cover (m2) per season",null,null,null,"Vertical extent of pollinator plant cover (m2) per season",null,null,null,"Number of different pollinator plant species per season"]
["Map Unit #","Vegetation Entry",null,"Spatial extent of Veg Type (m2)","Early","Mid","Late","Spatial extent of Veg Type (m2)","Early","Mid","Late","Early","Mid","Late"]
[{"$f":"A477","v":7},{"$f":"B477","v":1},null,{"$f":"+IF(ISNA(VLOOKUP(B514,B$477:D$511, 3, FALSE)),0,VLOOKUP(B514,B$477:D$511, 3, FALSE))","v":0},{"$f":"+IF(SUMIFS(T$477:T$511, B$477:B$511, $B514, V$477:V$511, \"*\"&\"Early\"&\"*\") <=$D514, SUMIFS(T$477:T$511, B$477:B$511, $B514, V$477:V$511, \"*\"&\"Early\"&\"*\"), $D514)","v":0},{"$f":"+IF(SUMIFS(T$477:T$511,B$477:B$511, $B514, V$477:V$511, \"*\"&\"Mid\"&\"*\") <=$D514, SUMIFS(T$477:T$511,B$477:B$511, $B514, V$477:V$511, \"*\"&\"Mid\"&\"*\"), $D514)","v":0},{"$f":"+IF(SUMIFS(T$477:T$511, B$477:B$511, $B514, $V$477:$V$511, \"*\"&\"Late\"&\"*\") <=$D514, SUMIFS(T$477:T$511,B$477:B$511, $B514,$V$477:$V$511, \"*\"&\"Late\"&\"*\"), $D514)","v":0},{"$f":"+IF(ISNA(VLOOKUP(B514,B$477:D$511, 3, FALSE)),0,VLOOKUP(B514,B$477:D$511, 3, FALSE))","v":0},{"$f":"+IF(SUMIFS($U$477:$U$511, $B$477:$B$511, $B514, $V$477:$V$511, \"*\"&\"Early\"&\"*\") <=$D514, SUMIFS($U$477:$U$511, $B$477:$B$511, $B514, $V$477:$V$511, \"*\"&\"Early\"&\"*\"), $D514)","v":0},{"$f":"+IF(SUMIFS($U$477:$U$511, $B$477:$B$511, $B514, $V$477:$V$511, \"*\"&\"Mid\"&\"*\") <=$D514, SUMIFS($U$477:$U$511, $B$477:$B$511, $B514, $V$477:$V$511, \"*\"&\"Mid\"&\"*\"), $D514)","v":0},{"$f":"+IF(SUMIFS($U$477:$U$511, $B$477:$B$511, $B514, $V$477:$V$511, \"*\"&\"Late\"&\"*\") <=$D514, SUMIFS($U$477:$U$511, $B$477:$B$511, $B514, $V$477:$V$511, \"*\"&\"Late\"&\"*\"), $D514)","v":0}," "]
[{"$f":"A478","v":7},2,null,{"$f":"+IF(ISNA(VLOOKUP(B515,B$477:D$511, 3, FALSE)),0,VLOOKUP(B515,B$477:D$511, 3, FALSE))","v":0},{"$f":"+IF(SUMIFS(T$477:T$511, B$477:B$511, $B515, V$477:V$511, \"*\"&\"Early\"&\"*\") <=$D515, SUMIFS(T$477:T$511, B$477:B$511, $B515, V$477:V$511, \"*\"&\"Early\"&\"*\"), $D515)","v":0},{"$f":"+IF(SUMIFS(T$477:T$511,B$477:B$511, $B515, V$477:V$511, \"*\"&\"Mid\"&\"*\") <=$D515, SUMIFS(T$477:T$511,B$477:B$511, $B515, V$477:V$511, \"*\"&\"Mid\"&\"*\"), $D515)","v":0},{"$f":"+IF(SUMIFS(T$477:T$511, B$477:B$511, $B515, $V$477:$V$511, \"*\"&\"Late\"&\"*\") <=$D515, SUMIFS(T$477:T$511,B$477:B$511, $B515,$V$477:$V$511, \"*\"&\"Late\"&\"*\"), $D515)","v":0},{"$f":"+IF(ISNA(VLOOKUP(B515,B$477:D$511, 3, FALSE)),0,VLOOKUP(B515,B$477:D$511, 3, FALSE))","v":0},{"$f":"+IF(SUMIFS($U$477:$U$511, $B$477:$B$511, $B515, $V$477:$V$511, \"*\"&\"Early\"&\"*\") <=$D515, SUMIFS($U$477:$U$511, $B$477:$B$511, $B515, $V$477:$V$511, \"*\"&\"Early\"&\"*\"), $D515)","v":0},{"$f":"+IF(SUMIFS($U$477:$U$511, $B$477:$B$511, $B515, $V$477:$V$511, \"*\"&\"Mid\"&\"*\") <=$D515, SUMIFS($U$477:$U$511, $B$477:$B$511, $B515, $V$477:$V$511, \"*\"&\"Mid\"&\"*\"), $D515)","v":0},{"$f":"+IF(SUMIFS($U$477:$U$511, $B$477:$B$511, $B515, $V$477:$V$511, \"*\"&\"Late\"&\"*\") <=$D515, SUMIFS($U$477:$U$511, $B$477:$B$511, $B515, $V$477:$V$511, \"*\"&\"Late\"&\"*\"), $D515)","v":0}," "]
[{"$f":"A479","v":7},3,null,0,0,0,0,0,0,0,0]
[{"$f":"A480","v":7},4,null,0,0,0,0,0,0,0,0]
[{"$f":"A481","v":7},5,null,0,0,0,0,0,0,0,0]
[{"$f":"A482","v":7},6,null,0,0,0,0,0,0,0,0]
[{"$f":"A483","v":7},7,null,0,0,0,0,0,0,0,0]
[{"$f":"A484","v":7},8,null,0,0,0,0,0,0,0,0]
[{"$f":"A485","v":7},9,null,0,0,0,0,0,0,0,0]
[{"$f":"A486","v":7},10,null,0,0,0,0,0,0,0,0]
[{"$f":"A487","v":7},11,null,{"$f":"+IF(ISNA(VLOOKUP(B524,B$477:D$511, 3, FALSE)),0,VLOOKUP(B524,B$477:D$511, 3, FALSE))","v":0},{"$f":"+IF(SUMIFS(T$477:T$511, B$477:B$511, $B524, V$477:V$511, \"*\"&\"Early\"&\"*\") <=$D524, SUMIFS(T$477:T$511, B$477:B$511, $B524, V$477:V$511, \"*\"&\"Early\"&\"*\"), $D524)","v":0},{"$f":"+IF(SUMIFS(T$477:T$511,B$477:B$511, $B524, V$477:V$511, \"*\"&\"Mid\"&\"*\") <=$D524, SUMIFS(T$477:T$511,B$477:B$511, $B524, V$477:V$511, \"*\"&\"Mid\"&\"*\"), $D524)","v":0},{"$f":"+IF(SUMIFS(T$477:T$511, B$477:B$511, $B524, $V$477:$V$511, \"*\"&\"Late\"&\"*\") <=$D524, SUMIFS(T$477:T$511,B$477:B$511, $B524,$V$477:$V$511, \"*\"&\"Late\"&\"*\"), $D524)","v":0},{"$f":"+IF(ISNA(VLOOKUP(B524,B$477:D$511, 3, FALSE)),0,VLOOKUP(B524,B$477:D$511, 3, FALSE))","v":0},0,0,0]
[{"$f":"A488","v":7},12,null,0,0,0,0,0,0,0,0]
[{"$f":"A489","v":7},13,null,0,0,0,0,0,0,0,0]
[{"$f":"A490","v":7},14,null,0,0,0,0,0,0,0,0]
[{"$f":"A491","v":7},15,null,0,0,0,0,0,0,0,0]
[{"$f":"A492","v":7},16,null,0,0,0,0,0,0,0,0]
[{"$f":"A493","v":7},17,null,0,0,0,0,0,0,0,0]
[{"$f":"A494","v":7},18,null,0,0,0,0,0,0,0,0]
[{"$f":"A495","v":7},19,null,0,0,0,0,0,0,0,0]
[{"$f":"A496","v":7},20,null,0,0,0,0,0,0,0,0]
[{"$f":"A497","v":7},21,null,0,0,0,0,0,0,0,0]
[{"$f":"A498","v":7},22,null,0,0,0,0,0,0,0,0]
[{"$f":"A499","v":7},23,null,0,0,0,0,0,0,0,0]
[{"$f":"A500","v":7},24,null,0,0,0,0,0,0,0,0]
[{"$f":"A501","v":7},25,null,0,0,0,0,0,0,0,0]
[{"$f":"A502","v":7},26,null,0,0,0,0,0,0,0,0]
[{"$f":"A503","v":7},27,null,0,0,0,0,0,0,0,0]
[{"$f":"A504","v":7},28,null,0,0,0,0,0,0,0,0]
[{"$f":"A505","v":7},29,null,0,0,0,0,0,0,0,0]
[{"$f":"A506","v":7},30,null,0,0,0,0,0,0,0,0]
[{"$f":"A507","v":7},31,null,0,0,0,0,0,0,0,0]
[{"$f":"A508","v":7},32,null,0,0,0,0,0,0,0,0]
[{"$f":"A509","v":7},33,null,0,0,0,0,0,0,0,0]
[{"$f":"A510","v":7},34,null,0,0,0,0,0,0,0,0]
[{"$f":"A511","v":7},35,null,0,0,0,0,0,0,0,0]
[{"$f":"A477","v":7},"Total",null,{"$f":"+SUM(D514:D548)","v":0},{"$f":"+SUM(E514:E548)","v":0},0,0,0,0,0,0,{"$f":"+X476","v":7},{"$f":"+Y476","v":10},{"$f":"+Z476","v":7}]
[null," ",null,{"$f":"D549","v":0},"Map Unit Size in Acres",null,{"$f":"FieldBeeForm!K14","v":20000},"Value entered in FieldBeeForm (Should be same as cell C375)"]
[]
["Enter only in yellow cells. Leave rest untouched.",null,null,null,null,null,"Enter the current year age in column G for each vegetation type. This age will be added to the assessment year (input on Field data form) to determine time series age in column K. If you are interested in just the current effects, enter a '0' in cell E11 of the Field data form."]
["Map Unit","Vegetation Entry","Map Unit Size","Spatial extent of Veg Type","Existing Cover Class for VegType","Species/ VegType","Existing Age of Average Plant \n(for S enter 1, for Sa enter 2, for P enter 3, for M enter 5, for D enter 10)","Species/Vegetation Type Descriptions","Ht Rate","Ht max","Future Age","Future Height","Canopy Width Max (m)","Canopy Width Rate","Existing Age canopy area per plant",null,"Estimated # Individuals","Future Horizontal Surface Area per plant (width x width)","Future Vertical Surface Area per plant (width x height)","Horizontal Surface Area Across Map Unit","Vertical Surface Area Across Map Unit","Season(s)","Season(s) (.)","Early","Mid","Late"]
["#","#"," sq ft","m2","%","code","yrs",null,"m/yr","m","yrs","m","m","m/yr","m2",null,"number","m2","m2","m2","m2",null,null,{"$f":"SUM(IF(FREQUENCY(MATCH(X555:X589, X555:X589,0),MATCH(X555:X589, X555:X589,0))>0,1))-1","v":7},{"$f":"SUM(IF(FREQUENCY(MATCH(Y555:Y589, Y555:Y589,0),MATCH(Y555:Y589, Y555:Y589,0))>0,1))-1","v":10},{"$f":"SUM(IF(FREQUENCY(MATCH(Z555:Z589, Z555:Z589,0),MATCH(Z555:Z589, Z555:Z589,0))>0,1))-1","v":7}]
[8,1,null,{"$f":"(0.092903*C555)*E555","v":0},0.06,1600,5,{"$f":"VLOOKUP(F555,VegTypeParameters!A:G,2,FALSE)","v":"Atriplex"},{"$f":"VLOOKUP($F555,VegTypeParameters!$A:$G,5,FALSE)","v":3.2962962962962963},{"$f":"VLOOKUP($F555,VegTypeParameters!$A:$G,4,FALSE)","v":3},{"$f":"G555+FieldBeeForm!$E$11","v":17},{"$f":"IF(J555>0,J555*(1-EXP(-I555*K555/J555)), 0)","v":2.9999999768298276},{"$f":"(VLOOKUP($F555,VegTypeParameters!A:G,6,FALSE))","v":5},{"$f":"(VLOOKUP($F555,VegTypeParameters!A:G,7,FALSE))","v":7.1111111111111107},{"$f":"IF(M555>0, (M555*(1-EXP(-N555*G555/M555)))*(M555*(1-EXP(-N555*G555/M555))),0)","v":24.959217254150069},null,{"$f":"IF(O555>0, (D555*E555)/O555,0)","v":0},{"$f":"IF(M555>0, (M555*(1-EXP(-N555*K555/M555)))*(M555*(1-EXP(-N555*K555/M555))), 0)","v":24.99999999841986},{"$f":"IF(M555>0,(M555*(1-EXP(-N555*K555/M555)))*L555,0)","v":14.999999883675097},{"$f":"R555*Q555","v":0},{"$f":"S555*Q555","v":0},{"$f":"VLOOKUP($F555,VegTypeParameters!$A:$H,8,FALSE)","v":"Mid/Late"},{"$f":"+IF(ISNA(V555), \".\",  V555)","v":"Mid/Late"},{"$f":"IF($W555=\"Early/Mid\",$H555,IF($W555=\"Early\", $H555, IF($W555=\"Early/Mid/Late\", $H555,\".\")))","v":"."},{"$f":"IF($W555=\"Early/Mid\",$H555,IF($W555=\"Mid\", $H555, IF($W555=\"Mid/Late\", $H555, IF($W555=\"Early/Mid/Late\", $H555,\".\"))))","v":"Atriplex"},{"$f":"IF($W555=\"Mid/Late\",$H555,IF($W555=\"Late\", $H555, IF($W555=\"Early/Mid/Late\", $H555,\".\")))","v":"Atriplex"}]
[8,2,{"$f":"+C$555","v":0},{"$f":"(0.092903*C556)*E556","v":0},0.03,4200,3,{"$f":"VLOOKUP(F556,VegTypeParameters!A:G,2,FALSE)","v":"Helianthus"},{"$f":"VLOOKUP($F556,VegTypeParameters!$A:$G,5,FALSE)","v":6.5},{"$f":"VLOOKUP($F556,VegTypeParameters!$A:$G,4,FALSE)","v":2.5},{"$f":"G556+FieldBeeForm!$E$11","v":15},2.5,{"$f":"(VLOOKUP($F556,VegTypeParameters!A:G,6,FALSE))","v":0.75},{"$f":"(VLOOKUP($F556,VegTypeParameters!A:G,7,FALSE))","v":1.25},0.55494534708652032,null,0,0.56249999998437616,1.8749999999739604,0,0,{"$f":"VLOOKUP($F556,VegTypeParameters!$A:$H,8,FALSE)","v":"Mid/Late"},{"$f":"+IF(ISNA(V556), \".\",  V556)","v":"Mid/Late"},{"$f":"IF($W556=\"Early/Mid\",$H556,IF($W556=\"Early\", $H556, IF($W556=\"Early/Mid/Late\", $H556,\".\")))","v":"."},{"$f":"IF($W556=\"Early/Mid\",$H556,IF($W556=\"Mid\", $H556, IF($W556=\"Mid/Late\", $H556, IF($W556=\"Early/Mid/Late\", $H556,\".\"))))","v":"Helianthus"},{"$f":"IF($W556=\"Mid/Late\",$H556,IF($W556=\"Late\", $H556, IF($W556=\"Early/Mid/Late\", $H556,\".\")))","v":"Helianthus"}]
[8,3,{"$f":"+C$555","v":0},0,0.08,4000,3,{"$f":"VLOOKUP(F557,VegTypeParameters!A:G,2,FALSE)","v":"Grindelia"},{"$f":"VLOOKUP($F557,VegTypeParameters!$A:$G,5,FALSE)","v":1.6666666666666667},{"$f":"VLOOKUP($F557,VegTypeParameters!$A:$G,4,FALSE)","v":2.5},{"$f":"G557+FieldBeeForm!$E$11","v":15},2.4998865001755939,{"$f":"(VLOOKUP($F557,VegTypeParameters!A:G,6,FALSE))","v":2},{"$f":"(VLOOKUP($F557,VegTypeParameters!A:G,7,FALSE))","v":1.3333333333333333},2.9905802896620353,null,0,3.9996368088065144,4.9995460110081433,0,0,{"$f":"VLOOKUP($F557,VegTypeParameters!$A:$H,8,FALSE)","v":"Mid/Late"},"Mid/Late",".","Grindelia","Grindelia"]
[8,4,0,0,0.08,7000,3,{"$f":"VLOOKUP(F558,VegTypeParameters!A:G,2,FALSE)","v":"Salix (shrub)"},{"$f":"VLOOKUP($F558,VegTypeParameters!$A:$G,5,FALSE)","v":0.73},{"$f":"VLOOKUP($F558,VegTypeParameters!$A:$G,4,FALSE)","v":3.5},{"$f":"G558+FieldBeeForm!$E$11","v":15},3.3467689644197414,{"$f":"(VLOOKUP($F558,VegTypeParameters!A:G,6,FALSE))","v":2.5},{"$f":"(VLOOKUP($F558,VegTypeParameters!A:G,7,FALSE))","v":0.55000000000000004},1.4589539561403246,null,0,5.7974627077191743,8.0583238111294335,0,0,{"$f":"VLOOKUP($F558,VegTypeParameters!$A:$H,8,FALSE)","v":"Early"},"Early","Salix (shrub)",".","."]
[8,5,0,0,0.08,8400,5,{"$f":"VLOOKUP(F559,VegTypeParameters!A:G,2,FALSE)","v":"Weeds, non-invasive and not beneficial to pollinators"},{"$f":"VLOOKUP($F559,VegTypeParameters!$A:$G,5,FALSE)","v":0},{"$f":"VLOOKUP($F559,VegTypeParameters!$A:$G,4,FALSE)","v":0},{"$f":"G559+FieldBeeForm!$E$11","v":17},0,{"$f":"(VLOOKUP($F559,VegTypeParameters!A:G,6,FALSE))","v":0},{"$f":"(VLOOKUP($F559,VegTypeParameters!A:G,7,FALSE))","v":0},0,null,0,0,0,0,0,{"$f":"VLOOKUP($F559,VegTypeParameters!$A:$H,8,FALSE)","v":"Never"},"Never",".",".","."]
[8,6,0,0,0.08,5300,3,{"$f":"VLOOKUP(F560,VegTypeParameters!A:G,2,FALSE)","v":"Medicago "},{"$f":"VLOOKUP($F560,VegTypeParameters!$A:$G,5,FALSE)","v":0.5},{"$f":"VLOOKUP($F560,VegTypeParameters!$A:$G,4,FALSE)","v":0.5},{"$f":"G560+FieldBeeForm!$E$11","v":15},0.49999984704883976,{"$f":"(VLOOKUP($F560,VegTypeParameters!A:G,6,FALSE))","v":0.7},{"$f":"(VLOOKUP($F560,VegTypeParameters!A:G,7,FALSE))","v":0.7},0.44242326156605982,null,0,0.48999970021577172,0.34999978586840841,0,0,{"$f":"VLOOKUP($F560,VegTypeParameters!$A:$H,8,FALSE)","v":"Mid/Late"},"Mid/Late",".","Medicago ","Medicago "]
[8,7,0,0,0.08,1600,3,{"$f":"VLOOKUP(F561,VegTypeParameters!A:G,2,FALSE)","v":"Atriplex"},{"$f":"VLOOKUP($F561,VegTypeParameters!$A:$G,5,FALSE)","v":3.2962962962962963},{"$f":"VLOOKUP($F561,VegTypeParameters!$A:$G,4,FALSE)","v":3},{"$f":"G561+FieldBeeForm!$E$11","v":15},2.999999791404568,{"$f":"(VLOOKUP($F561,VegTypeParameters!A:G,6,FALSE))","v":5},{"$f":"(VLOOKUP($F561,VegTypeParameters!A:G,7,FALSE))","v":7.1111111111111107},24.303496604054391,null,0,24.999999972834292,14.999998948873127,0,0,{"$f":"VLOOKUP($F561,VegTypeParameters!$A:$H,8,FALSE)","v":"Mid/Late"},"Mid/Late",".","Atriplex","Atriplex"]
[8,8,0,0,0.03,7500,3,{"$f":"VLOOKUP(F562,VegTypeParameters!A:G,2,FALSE)","v":"Scrophularia"},{"$f":"VLOOKUP($F562,VegTypeParameters!$A:$G,5,FALSE)","v":1.2},{"$f":"VLOOKUP($F562,VegTypeParameters!$A:$G,4,FALSE)","v":1.2},{"$f":"G562+FieldBeeForm!$E$11","v":15},1.1999996329172153,{"$f":"(VLOOKUP($F562,VegTypeParameters!A:G,6,FALSE))","v":0.3},{"$f":"(VLOOKUP($F562,VegTypeParameters!A:G,7,FALSE))","v":0.3},8.1261415389684455E-2,null,0,8.9999944937590726E-2,0.3599997797503629,0,0,{"$f":"VLOOKUP($F562,VegTypeParameters!$A:$H,8,FALSE)","v":"Early/Mid"},"Early/Mid","Scrophularia","Scrophularia","."]
[8,9,0,0,0.03,3500,3,{"$f":"VLOOKUP(F563,VegTypeParameters!A:G,2,FALSE)","v":"Ficus carica"},{"$f":"VLOOKUP($F563,VegTypeParameters!$A:$G,5,FALSE)","v":0},{"$f":"VLOOKUP($F563,VegTypeParameters!$A:$G,4,FALSE)","v":0},{"$f":"G563+FieldBeeForm!$E$11","v":15},0,{"$f":"(VLOOKUP($F563,VegTypeParameters!A:G,6,FALSE))","v":0},{"$f":"(VLOOKUP($F563,VegTypeParameters!A:G,7,FALSE))","v":0},0,null,0,0,0,0,0,{"$f":"VLOOKUP($F563,VegTypeParameters!$A:$H,8,FALSE)","v":"Never"},"Never",".",".","."]
[8,10,0,0,0.03,6200,3,{"$f":"VLOOKUP(F564,VegTypeParameters!A:G,2,FALSE)","v":"Other late blooming native plants beneficial to pollinators"},{"$f":"VLOOKUP($F564,VegTypeParameters!$A:$G,5,FALSE)","v":0.25},{"$f":"VLOOKUP($F564,VegTypeParameters!$A:$G,4,FALSE)","v":1},{"$f":"G564+FieldBeeForm!$E$11","v":15},0.97648225414399092,{"$f":"(VLOOKUP($F564,VegTypeParameters!A:G,6,FALSE))","v":0.5},{"$f":"(VLOOKUP($F564,VegTypeParameters!A:G,7,FALSE))","v":0.25},0.15088168701775109,null,0,0.24972353429050623,0.48797108853574861,0,0,{"$f":"VLOOKUP($F564,VegTypeParameters!$A:$H,8,FALSE)","v":"Late"},"Late",".",".","Other late blooming native plants beneficial to pollinators"]
[8,11,0,0,0.03,2500,3,{"$f":"VLOOKUP(F565,VegTypeParameters!A:G,2,FALSE)","v":"Clarkia"},{"$f":"VLOOKUP($F565,VegTypeParameters!$A:$G,5,FALSE)","v":0.4},{"$f":"VLOOKUP($F565,VegTypeParameters!$A:$G,4,FALSE)","v":0.4},{"$f":"G565+FieldBeeForm!$E$11","v":15},0.39999987763907185,{"$f":"(VLOOKUP($F565,VegTypeParameters!A:G,6,FALSE))","v":0.1},{"$f":"(VLOOKUP($F565,VegTypeParameters!A:G,7,FALSE))","v":0.1},9.029046154409387E-3,null,0,9.9999938819545289E-3,3.9999975527818116E-2,0,0,{"$f":"VLOOKUP($F565,VegTypeParameters!$A:$H,8,FALSE)","v":"Early/Mid"},"Early/Mid","Clarkia","Clarkia","."]
[8,12,0,0,0.08,5000,3,{"$f":"VLOOKUP(F566,VegTypeParameters!A:G,2,FALSE)","v":"Lupinus spp."},{"$f":"VLOOKUP($F566,VegTypeParameters!$A:$G,5,FALSE)","v":0.98000000000000009},{"$f":"VLOOKUP($F566,VegTypeParameters!$A:$G,4,FALSE)","v":3},{"$f":"G566+FieldBeeForm!$E$11","v":15},2.9776602507872267,{"$f":"(VLOOKUP($F566,VegTypeParameters!A:G,6,FALSE))","v":3},{"$f":"(VLOOKUP($F566,VegTypeParameters!A:G,7,FALSE))","v":1.08},3.925206627733659,null,0,8.9188851385636738,8.8926342217348378,0,0,{"$f":"VLOOKUP($F566,VegTypeParameters!$A:$H,8,FALSE)","v":"Early/Mid/Late"},"Early/Mid/Late","Lupinus spp.","Lupinus spp.","Lupinus spp."]
[8,13,0,0,0.08,6000,3,{"$f":"VLOOKUP(F567,VegTypeParameters!A:G,2,FALSE)","v":"Orchard"},{"$f":"VLOOKUP($F567,VegTypeParameters!$A:$G,5,FALSE)","v":0.5},{"$f":"VLOOKUP($F567,VegTypeParameters!$A:$G,4,FALSE)","v":10},{"$f":"G567+FieldBeeForm!$E$11","v":15},5.2763344725898529,{"$f":"(VLOOKUP($F567,VegTypeParameters!A:G,6,FALSE))","v":6},{"$f":"(VLOOKUP($F567,VegTypeParameters!A:G,7,FALSE))","v":0.5},1.7614473685136525,null,0,18.326714576526665,22.58783601812447,0,0,{"$f":"VLOOKUP($F567,VegTypeParameters!$A:$H,8,FALSE)","v":"Early"},"Early","Orchard",".","."]
[8,14,0,0,0.03,3300,5,{"$f":"VLOOKUP(F568,VegTypeParameters!A:G,2,FALSE)","v":"Eschscholzia"},{"$f":"VLOOKUP($F568,VegTypeParameters!$A:$G,5,FALSE)","v":0.6},{"$f":"VLOOKUP($F568,VegTypeParameters!$A:$G,4,FALSE)","v":0.3},{"$f":"G568+FieldBeeForm!$E$11","v":17},0.29999999999999949,{"$f":"(VLOOKUP($F568,VegTypeParameters!A:G,6,FALSE))","v":0.15},{"$f":"(VLOOKUP($F568,VegTypeParameters!A:G,7,FALSE))","v":0.3},2.2497957049536645E-2,null,0,2.2499999999999923E-2,4.4999999999999846E-2,0,0,{"$f":"VLOOKUP($F568,VegTypeParameters!$A:$H,8,FALSE)","v":"Early/Mid"},"Early/Mid","Eschscholzia","Eschscholzia","."]
[8,15,0,0,0.03,5600,3,{"$f":"VLOOKUP(F569,VegTypeParameters!A:G,2,FALSE)","v":"Native forbs and graminoids not beneficial to pollinators"},{"$f":"VLOOKUP($F569,VegTypeParameters!$A:$G,5,FALSE)","v":0},{"$f":"VLOOKUP($F569,VegTypeParameters!$A:$G,4,FALSE)","v":0},{"$f":"G569+FieldBeeForm!$E$11","v":15},{"$f":"IF(J569>0,J569*(1-EXP(-I569*K569/J569)), 0)","v":0},{"$f":"(VLOOKUP($F569,VegTypeParameters!A:G,6,FALSE))","v":0},{"$f":"(VLOOKUP($F569,VegTypeParameters!A:G,7,FALSE))","v":0},{"$f":"IF(M569>0, (M569*(1-EXP(-N569*G569/M569)))*(M569*(1-EXP(-N569*G569/M569))),0)","v":0},null,{"$f":"IF(O569>0, (D569*E569)/O569,0)","v":0},{"$f":"IF(M569>0, (M569*(1-EXP(-N569*K569/M569)))*(M569*(1-EXP(-N569*K569/M569))), 0)","v":0},{"$f":"IF(M569>0,(M569*(1-EXP(-N569*K569/M569)))*L569,0)","v":0},0,0,{"$f":"VLOOKUP($F569,VegTypeParameters!$A:$H,8,FALSE)","v":"Never"},"Never",".",".","."]
[8,16,0,0,0.08,3800,3,{"$f":"VLOOKUP(F570,VegTypeParameters!A:G,2,FALSE)","v":"Gilia"},{"$f":"VLOOKUP($F570,VegTypeParameters!$A:$G,5,FALSE)","v":0.6},{"$f":"VLOOKUP($F570,VegTypeParameters!$A:$G,4,FALSE)","v":0.3},{"$f":"G570+FieldBeeForm!$E$11","v":15},{"$f":"IF(J570>0,J570*(1-EXP(-I570*K570/J570)), 0)","v":0.2999999999999719},{"$f":"(VLOOKUP($F570,VegTypeParameters!A:G,6,FALSE))","v":0.15},{"$f":"(VLOOKUP($F570,VegTypeParameters!A:G,7,FALSE))","v":0.3},{"$f":"IF(M570>0, (M570*(1-EXP(-N570*G570/M570)))*(M570*(1-EXP(-N570*G570/M570))),0)","v":2.2388594396827964E-2},null,{"$f":"IF(O570>0, (D570*E570)/O570,0)","v":0},{"$f":"IF(M570>0, (M570*(1-EXP(-N570*K570/M570)))*(M570*(1-EXP(-N570*K570/M570))), 0)","v":2.2499999999995784E-2},{"$f":"IF(M570>0,(M570*(1-EXP(-N570*K570/M570)))*L570,0)","v":4.4999999999991568E-2},0,0,{"$f":"VLOOKUP($F570,VegTypeParameters!$A:$H,8,FALSE)","v":"Mid"},"Mid",".","Gilia","."]
[8,17,0,0,0.08,1500,3,{"$f":"VLOOKUP(F571,VegTypeParameters!A:G,2,FALSE)","v":"Asclepias"},{"$f":"VLOOKUP($F571,VegTypeParameters!$A:$G,5,FALSE)","v":0.8},{"$f":"VLOOKUP($F571,VegTypeParameters!$A:$G,4,FALSE)","v":0.8},{"$f":"G571+FieldBeeForm!$E$11","v":15},0.79999975527814371,{"$f":"(VLOOKUP($F571,VegTypeParameters!A:G,6,FALSE))","v":0.2},{"$f":"(VLOOKUP($F571,VegTypeParameters!A:G,7,FALSE))","v":0.2},3.6116184617637548E-2,null,0,3.9999975527818116E-2,0.15999990211127246,0,0,{"$f":"VLOOKUP($F571,VegTypeParameters!$A:$H,8,FALSE)","v":"Early/Mid/Late"},"Early/Mid/Late","Asclepias","Asclepias","Asclepias"]
[8,18,0,0,5.0000000000000001E-3,1600,1,{"$f":"VLOOKUP(F572,VegTypeParameters!A:G,2,FALSE)","v":"Atriplex"},{"$f":"VLOOKUP($F572,VegTypeParameters!$A:$G,5,FALSE)","v":3.2962962962962963},{"$f":"VLOOKUP($F572,VegTypeParameters!$A:$G,4,FALSE)","v":3},{"$f":"G572+FieldBeeForm!$E$11","v":13},2.9999981220660135,{"$f":"(VLOOKUP($F572,VegTypeParameters!A:G,6,FALSE))","v":5},{"$f":"(VLOOKUP($F572,VegTypeParameters!A:G,7,FALSE))","v":7.1111111111111107},14.395290762184326,null,0,24.999999532966985,14.999990470220251,0,0,{"$f":"VLOOKUP($F572,VegTypeParameters!$A:$H,8,FALSE)","v":"Mid/Late"},"Mid/Late",".","Atriplex","Atriplex"]
[8,19,0,0,null,null,null,{"$f":"VLOOKUP(F573,VegTypeParameters!A:G,2,FALSE)","v":{"$error":"#N/A"}},{"$f":"VLOOKUP($F573,VegTypeParameters!$A:$G,5,FALSE)","v":{"$error":"#N/A"}},{"$f":"VLOOKUP($F573,VegTypeParameters!$A:$G,4,FALSE)","v":{"$error":"#N/A"}},{"$f":"G573+FieldBeeForm!$E$11","v":12},{"$error":"#N/A"},{"$f":"(VLOOKUP($F573,VegTypeParameters!A:G,6,FALSE))","v":{"$error":"#N/A"}},{"$f":"(VLOOKUP($F573,VegTypeParameters!A:G,7,FALSE))","v":{"$error":"#N/A"}},{"$error":"#N/A"},null,{"$error":"#N/A"},{"$error":"#N/A"},{"$error":"#N/A"},{"$error":"#N/A"},{"$error":"#N/A"},{"$f":"VLOOKUP($F573,VegTypeParameters!$A:$H,8,FALSE)","v":{"$error":"#N/A"}},".",".",".","."]
[8,20,0,0,null,null,null,{"$f":"VLOOKUP(F574,VegTypeParameters!A:G,2,FALSE)","v":{"$error":"#N/A"}},{"$f":"VLOOKUP($F574,VegTypeParameters!$A:$G,5,FALSE)","v":{"$error":"#N/A"}},{"$f":"VLOOKUP($F574,VegTypeParameters!$A:$G,4,FALSE)","v":{"$error":"#N/A"}},{"$f":"G574+FieldBeeForm!$E$11","v":12},{"$error":"#N/A"},{"$f":"(VLOOKUP($F574,VegTypeParameters!A:G,6,FALSE))","v":{"$error":"#N/A"}},{"$f":"(VLOOKUP($F574,VegTypeParameters!A:G,7,FALSE))","v":{"$error":"#N/A"}},{"$error":"#N/A"},null,{"$error":"#N/A"},{"$error":"#N/A"},{"$error":"#N/A"},{"$error":"#N/A"},{"$error":"#N/A"},{"$f":"VLOOKUP($F574,VegTypeParameters!$A:$H,8,FALSE)","v":{"$error":"#N/A"}},".",".",".","."]
[8,21,0,0,null,null,null,{"$f":"VLOOKUP(F575,VegTypeParameters!A:G,2,FALSE)","v":{"$error":"#N/A"}},{"$f":"VLOOKUP($F575,VegTypeParameters!$A:$G,5,FALSE)","v":{"$error":"#N/A"}},{"$f":"VLOOKUP($F575,VegTypeParameters!$A:$G,4,FALSE)","v":{"$error":"#N/A"}},{"$f":"G575+FieldBeeForm!$E$11","v":12},{"$error":"#N/A"},{"$f":"(VLOOKUP($F575,VegTypeParameters!A:G,6,FALSE))","v":{"$error":"#N/A"}},{"$f":"(VLOOKUP($F575,VegTypeParameters!A:G,7,FALSE))","v":{"$error":"#N/A"}},{"$error":"#N/A"},null,{"$error":"#N/A"},{"$error":"#N/A"},{"$error":"#N/A"},{"$error":"#N/A"},{"$error":"#N/A"},{"$f":"VLOOKUP($F575,VegTypeParameters!$A:$H,8,FALSE)","v":{"$error":"#N/A"}},".",".",".","."]
[8,22,0,0,null,null,null,{"$f":"VLOOKUP(F576,VegTypeParameters!A:G,2,FALSE)","v":{"$error":"#N/A"}},{"$f":"VLOOKUP($F576,VegTypeParameters!$A:$G,5,FALSE)","v":{"$error":"#N/A"}},{"$f":"VLOOKUP($F576,VegTypeParameters!$A:$G,4,FALSE)","v":{"$error":"#N/A"}},{"$f":"G576+FieldBeeForm!$E$11","v":12},{"$error":"#N/A"},{"$f":"(VLOOKUP($F576,VegTypeParameters!A:G,6,FALSE))","v":{"$error":"#N/A"}},{"$f":"(VLOOKUP($F576,VegTypeParameters!A:G,7,FALSE))","v":{"$error":"#N/A"}},{"$error":"#N/A"},null,{"$error":"#N/A"},{"$error":"#N/A"},{"$error":"#N/A"},{"$error":"#N/A"},{"$error":"#N/A"},{"$f":"VLOOKUP($F576,VegTypeParameters!$A:$H,8,FALSE)","v":{"$error":"#N/A"}},".",".",".","."]
[8,23,0,0,null,null,null,{"$f":"VLOOKUP(F577,VegTypeParameters!A:G,2,FALSE)","v":{"$error":"#N/A"}},{"$f":"VLOOKUP($F577,VegTypeParameters!$A:$G,5,FALSE)","v":{"$error":"#N/A"}},{"$f":"VLOOKUP($F577,VegTypeParameters!$A:$G,4,FALSE)","v":{"$error":"#N/A"}},{"$f":"G577+FieldBeeForm!$E$11","v":12},{"$error":"#N/A"},{"$f":"(VLOOKUP($F577,VegTypeParameters!A:G,6,FALSE))","v":{"$error":"#N/A"}},{"$f":"(VLOOKUP($F577,VegTypeParameters!A:G,7,FALSE))","v":{"$error":"#N/A"}},{"$error":"#N/A"},null,{"$error":"#N/A"},{"$error":"#N/A"},{"$error":"#N/A"},{"$error":"#N/A"},{"$error":"#N/A"},{"$f":"VLOOKUP($F577,VegTypeParameters!$A:$H,8,FALSE)","v":{"$error":"#N/A"}},".",".",".","."]
[8,24,0,0,null,null,null,{"$f":"VLOOKUP(F578,VegTypeParameters!A:G,2,FALSE)","v":{"$error":"#N/A"}},{"$f":"VLOOKUP($F578,VegTypeParameters!$A:$G,5,FALSE)","v":{"$error":"#N/A"}},{"$f":"VLOOKUP($F578,VegTypeParameters!$A:$G,4,FALSE)","v":{"$error":"#N/A"}},{"$f":"G578+FieldBeeForm!$E$11","v":12},{"$error":"#N/A"},{"$f":"(VLOOKUP($F578,VegTypeParameters!A:G,6,FALSE))","v":{"$error":"#N/A"}},{"$f":"(VLOOKUP($F578,VegTypeParameters!A:G,7,FALSE))","v":{"$error":"#N/A"}},{"$error":"#N/A"},null,{"$error":"#N/A"},{"$error":"#N/A"},{"$error":"#N/A"},{"$error":"#N/A"},{"$error":"#N/A"},{"$f":"VLOOKUP($F578,VegTypeParameters!$A:$H,8,FALSE)","v":{"$error":"#N/A"}},".",".",".","."]
[8,25,0,0,null,null,null,{"$f":"VLOOKUP(F579,VegTypeParameters!A:G,2,FALSE)","v":{"$error":"#N/A"}},{"$f":"VLOOKUP($F579,VegTypeParameters!$A:$G,5,FALSE)","v":{"$error":"#N/A"}},{"$f":"VLOOKUP($F579,VegTypeParameters!$A:$G,4,FALSE)","v":{"$error":"#N/A"}},{"$f":"G579+FieldBeeForm!$E$11","v":12},{"$f":"IF(J579>0,J579*(1-EXP(-I579*K579/J579)), 0)","v":{"$error":"#N/A"}},{"$f":"(VLOOKUP($F579,VegTypeParameters!A:G,6,FALSE))","v":{"$error":"#N/A"}},{"$f":"(VLOOKUP($F579,VegTypeParameters!A:G,7,FALSE))","v":{"$error":"#N/A"}},{"$f":"IF(M579>0, (M579*(1-EXP(-N579*G579/M579)))*(M579*(1-EXP(-N579*G579/M579))),0)","v":{"$error":"#N/A"}},null,{"$f":"IF(O579>0, (D579*E579)/O579,0)","v":{"$error":"#N/A"}},{"$f":"IF(M579>0, (M579*(1-EXP(-N579*K579/M579)))*(M579*(1-EXP(-N579*K579/M579))), 0)","v":{"$error":"#N/A"}},{"$f":"IF(M579>0,(M579*(1-EXP(-N579*K579/M579)))*L579,0)","v":{"$error":"#N/A"}},{"$error":"#N/A"},{"$error":"#N/A"},{"$f":"VLOOKUP($F579,VegTypeParameters!$A:$H,8,FALSE)","v":{"$error":"#N/A"}},".",".",".","."]
[8,26,0,0,null,null,null,{"$f":"VLOOKUP(F580,VegTypeParameters!A:G,2,FALSE)","v":{"$error":"#N/A"}},{"$f":"VLOOKUP($F580,VegTypeParameters!$A:$G,5,FALSE)","v":{"$error":"#N/A"}},{"$f":"VLOOKUP($F580,VegTypeParameters!$A:$G,4,FALSE)","v":{"$error":"#N/A"}},{"$f":"G580+FieldBeeForm!$E$11","v":12},{"$f":"IF(J580>0,J580*(1-EXP(-I580*K580/J580)), 0)","v":{"$error":"#N/A"}},{"$f":"(VLOOKUP($F580,VegTypeParameters!A:G,6,FALSE))","v":{"$error":"#N/A"}},{"$f":"(VLOOKUP($F580,VegTypeParameters!A:G,7,FALSE))","v":{"$error":"#N/A"}},{"$f":"IF(M580>0, (M580*(1-EXP(-N580*G580/M580)))*(M580*(1-EXP(-N580*G580/M580))),0)","v":{"$error":"#N/A"}},null,{"$f":"IF(O580>0, (D580*E580)/O580,0)","v":{"$error":"#N/A"}},{"$f":"IF(M580>0, (M580*(1-EXP(-N580*K580/M580)))*(M580*(1-EXP(-N580*K580/M580))), 0)","v":{"$error":"#N/A"}},{"$f":"IF(M580>0,(M580*(1-EXP(-N580*K580/M580)))*L580,0)","v":{"$error":"#N/A"}},{"$error":"#N/A"},{"$error":"#N/A"},{"$f":"VLOOKUP($F580,VegTypeParameters!$A:$H,8,FALSE)","v":{"$error":"#N/A"}},".",".",".","."]
[8,27,0,0,null,null,null,{"$f":"VLOOKUP(F581,VegTypeParameters!A:G,2,FALSE)","v":{"$error":"#N/A"}},{"$f":"VLOOKUP($F581,VegTypeParameters!$A:$G,5,FALSE)","v":{"$error":"#N/A"}},{"$f":"VLOOKUP($F581,VegTypeParameters!$A:$G,4,FALSE)","v":{"$error":"#N/A"}},{"$f":"G581+FieldBeeForm!$E$11","v":12},{"$error":"#N/A"},{"$f":"(VLOOKUP($F581,VegTypeParameters!A:G,6,FALSE))","v":{"$error":"#N/A"}},{"$f":"(VLOOKUP($F581,VegTypeParameters!A:G,7,FALSE))","v":{"$error":"#N/A"}},{"$error":"#N/A"},null,{"$error":"#N/A"},{"$error":"#N/A"},{"$error":"#N/A"},{"$error":"#N/A"},{"$error":"#N/A"},{"$f":"VLOOKUP($F581,VegTypeParameters!$A:$H,8,FALSE)","v":{"$error":"#N/A"}},".",".",".","."]
[8,28,0,0,null,null,null,{"$f":"VLOOKUP(F582,VegTypeParameters!A:G,2,FALSE)","v":{"$error":"#N/A"}},{"$f":"VLOOKUP($F582,VegTypeParameters!$A:$G,5,FALSE)","v":{"$error":"#N/A"}},{"$f":"VLOOKUP($F582,VegTypeParameters!$A:$G,4,FALSE)","v":{"$error":"#N/A"}},{"$f":"G582+FieldBeeForm!$E$11","v":12},{"$error":"#N/A"},{"$f":"(VLOOKUP($F582,VegTypeParameters!A:G,6,FALSE))","v":{"$error":"#N/A"}},{"$f":"(VLOOKUP($F582,VegTypeParameters!A:G,7,FALSE))","v":{"$error":"#N/A"}},{"$error":"#N/A"},null,{"$error":"#N/A"},{"$error":"#N/A"},{"$error":"#N/A"},{"$error":"#N/A"},{"$error":"#N/A"},{"$f":"VLOOKUP($F582,VegTypeParameters!$A:$H,8,FALSE)","v":{"$error":"#N/A"}},".",".",".","."]
[8,29,0,0,null,null,null,{"$f":"VLOOKUP(F583,VegTypeParameters!A:G,2,FALSE)","v":{"$error":"#N/A"}},{"$f":"VLOOKUP($F583,VegTypeParameters!$A:$G,5,FALSE)","v":{"$error":"#N/A"}},{"$f":"VLOOKUP($F583,VegTypeParameters!$A:$G,4,FALSE)","v":{"$error":"#N/A"}},{"$f":"G583+FieldBeeForm!$E$11","v":12},{"$error":"#N/A"},{"$f":"(VLOOKUP($F583,VegTypeParameters!A:G,6,FALSE))","v":{"$error":"#N/A"}},{"$f":"(VLOOKUP($F583,VegTypeParameters!A:G,7,FALSE))","v":{"$error":"#N/A"}},{"$error":"#N/A"},null,{"$error":"#N/A"},{"$error":"#N/A"},{"$error":"#N/A"},{"$error":"#N/A"},{"$error":"#N/A"},{"$f":"VLOOKUP($F583,VegTypeParameters!$A:$H,8,FALSE)","v":{"$error":"#N/A"}},".",".",".","."]
[8,30,0,0,null,null,null,{"$f":"VLOOKUP(F584,VegTypeParameters!A:G,2,FALSE)","v":{"$error":"#N/A"}},{"$f":"VLOOKUP($F584,VegTypeParameters!$A:$G,5,FALSE)","v":{"$error":"#N/A"}},{"$f":"VLOOKUP($F584,VegTypeParameters!$A:$G,4,FALSE)","v":{"$error":"#N/A"}},{"$f":"G584+FieldBeeForm!$E$11","v":12},{"$error":"#N/A"},{"$f":"(VLOOKUP($F584,VegTypeParameters!A:G,6,FALSE))","v":{"$error":"#N/A"}},{"$f":"(VLOOKUP($F584,VegTypeParameters!A:G,7,FALSE))","v":{"$error":"#N/A"}},{"$error":"#N/A"},null,{"$error":"#N/A"},{"$error":"#N/A"},{"$error":"#N/A"},{"$error":"#N/A"},{"$error":"#N/A"},{"$f":"VLOOKUP($F584,VegTypeParameters!$A:$H,8,FALSE)","v":{"$error":"#N/A"}},".",".",".","."]
[8,31,0,0,null,null,null,{"$f":"VLOOKUP(F585,VegTypeParameters!A:G,2,FALSE)","v":{"$error":"#N/A"}},{"$f":"VLOOKUP($F585,VegTypeParameters!$A:$G,5,FALSE)","v":{"$error":"#N/A"}},{"$f":"VLOOKUP($F585,VegTypeParameters!$A:$G,4,FALSE)","v":{"$error":"#N/A"}},{"$f":"G585+FieldBeeForm!$E$11","v":12},{"$error":"#N/A"},{"$f":"(VLOOKUP($F585,VegTypeParameters!A:G,6,FALSE))","v":{"$error":"#N/A"}},{"$f":"(VLOOKUP($F585,VegTypeParameters!A:G,7,FALSE))","v":{"$error":"#N/A"}},{"$error":"#N/A"},null,{"$error":"#N/A"},{"$error":"#N/A"},{"$error":"#N/A"},{"$error":"#N/A"},{"$error":"#N/A"},{"$f":"VLOOKUP($F585,VegTypeParameters!$A:$H,8,FALSE)","v":{"$error":"#N/A"}},".",".",".","."]
[8,32,0,0,null,null,null,{"$f":"VLOOKUP(F586,VegTypeParameters!A:G,2,FALSE)","v":{"$error":"#N/A"}},{"$f":"VLOOKUP($F586,VegTypeParameters!$A:$G,5,FALSE)","v":{"$error":"#N/A"}},{"$f":"VLOOKUP($F586,VegTypeParameters!$A:$G,4,FALSE)","v":{"$error":"#N/A"}},{"$f":"G586+FieldBeeForm!$E$11","v":12},{"$error":"#N/A"},{"$f":"(VLOOKUP($F586,VegTypeParameters!A:G,6,FALSE))","v":{"$error":"#N/A"}},{"$f":"(VLOOKUP($F586,VegTypeParameters!A:G,7,FALSE))","v":{"$error":"#N/A"}},{"$error":"#N/A"},null,{"$error":"#N/A"},{"$error":"#N/A"},{"$error":"#N/A"},{"$error":"#N/A"},{"$error":"#N/A"},{"$f":"VLOOKUP($F586,VegTypeParameters!$A:$H,8,FALSE)","v":{"$error":"#N/A"}},".",".",".","."]
[8,33,0,0,null,null,null,{"$f":"VLOOKUP(F587,VegTypeParameters!A:G,2,FALSE)","v":{"$error":"#N/A"}},{"$f":"VLOOKUP($F587,VegTypeParameters!$A:$G,5,FALSE)","v":{"$error":"#N/A"}},{"$f":"VLOOKUP($F587,VegTypeParameters!$A:$G,4,FALSE)","v":{"$error":"#N/A"}},{"$f":"G587+FieldBeeForm!$E$11","v":12},{"$error":"#N/A"},{"$f":"(VLOOKUP($F587,VegTypeParameters!A:G,6,FALSE))","v":{"$error":"#N/A"}},{"$f":"(VLOOKUP($F587,VegTypeParameters!A:G,7,FALSE))","v":{"$error":"#N/A"}},{"$error":"#N/A"},null,{"$error":"#N/A"},{"$error":"#N/A"},{"$error":"#N/A"},{"$error":"#N/A"},{"$error":"#N/A"},{"$f":"VLOOKUP($F587,VegTypeParameters!$A:$H,8,FALSE)","v":{"$error":"#N/A"}},".",".",".","."]
[8,34,0,0,null,null,null,{"$f":"VLOOKUP(F588,VegTypeParameters!A:G,2,FALSE)","v":{"$error":"#N/A"}},{"$f":"VLOOKUP($F588,VegTypeParameters!$A:$G,5,FALSE)","v":{"$error":"#N/A"}},{"$f":"VLOOKUP($F588,VegTypeParameters!$A:$G,4,FALSE)","v":{"$error":"#N/A"}},{"$f":"G588+FieldBeeForm!$E$11","v":12},{"$error":"#N/A"},{"$f":"(VLOOKUP($F588,VegTypeParameters!A:G,6,FALSE))","v":{"$error":"#N/A"}},{"$f":"(VLOOKUP($F588,VegTypeParameters!A:G,7,FALSE))","v":{"$error":"#N/A"}},{"$error":"#N/A"},null,{"$error":"#N/A"},{"$error":"#N/A"},{"$error":"#N/A"},{"$error":"#N/A"},{"$error":"#N/A"},{"$f":"VLOOKUP($F588,VegTypeParameters!$A:$H,8,FALSE)","v":{"$error":"#N/A"}},".",".",".","."]
[8,35,0,0,null,null,null,{"$f":"VLOOKUP(F589,VegTypeParameters!A:G,2,FALSE)","v":{"$error":"#N/A"}},{"$f":"VLOOKUP($F589,VegTypeParameters!$A:$G,5,FALSE)","v":{"$error":"#N/A"}},{"$f":"VLOOKUP($F589,VegTypeParameters!$A:$G,4,FALSE)","v":{"$error":"#N/A"}},{"$f":"G589+FieldBeeForm!$E$11","v":12},{"$error":"#N/A"},{"$f":"(VLOOKUP($F589,VegTypeParameters!A:G,6,FALSE))","v":{"$error":"#N/A"}},{"$f":"(VLOOKUP($F589,VegTypeParameters!A:G,7,FALSE))","v":{"$error":"#N/A"}},{"$error":"#N/A"},null,{"$error":"#N/A"},{"$error":"#N/A"},{"$error":"#N/A"},{"$error":"#N/A"},{"$error":"#N/A"},{"$f":"VLOOKUP($F589,VegTypeParameters!$A:$H,8,FALSE)","v":{"$error":"#N/A"}},".",".",".","."]
[null,null,null,"Horizontal extent of pollinator plant cover (m2) per season",null,null,null,"Vertical extent of pollinator plant cover (m2) per season",null,null,null,"Number of different pollinator plant species per season"]
["Map Unit #","Vegetation Entry",null,"Spatial extent of Veg Type (m2)","Early","Mid","Late","Spatial extent of Veg Type (m2)","Early","Mid","Late","Early","Mid","Late"]
[{"$f":"A555","v":8},{"$f":"B555","v":1},null,{"$f":"+IF(ISNA(VLOOKUP(B592,B$555:D$589, 3, FALSE)),0,VLOOKUP(B592,B$555:D$589, 3, FALSE))","v":0},{"$f":"+IF(SUMIFS(T$477:T$511, B$555:B$589, $B592, V$555:V$589, \"*\"&\"Early\"&\"*\") <=$D592, SUMIFS(T$555:T$589, B$555:B$589, $B592, V$555:V$589, \"*\"&\"Early\"&\"*\"), $D592)","v":0},{"$f":"+IF(SUMIFS(T$477:T$511,B$555:B$589, $B592, V$555:V$589, \"*\"&\"Mid\"&\"*\") <=$D592, SUMIFS(T$555:T$589,B$555:B$589, $B592, V$555:V$589, \"*\"&\"Mid\"&\"*\"), $D592)","v":0},{"$f":"+IF(SUMIFS(T$555:T$589, B$555:B$589, $B592, $V$555:$V$589, \"*\"&\"Late\"&\"*\") <=$D592, SUMIFS(T$555:T$589,B$555:B$589, $B592,$V$555:$V$589, \"*\"&\"Late\"&\"*\"), $D592)","v":0},{"$f":"+IF(ISNA(VLOOKUP(B592,B$555:D$589, 3, FALSE)),0,VLOOKUP(B592,B$555:D$589, 3, FALSE))","v":0},{"$f":"+IF(SUMIFS($U$555:$U$589, $B$555:$B$589, $B592, $V$555:$V$589, \"*\"&\"Early\"&\"*\") <=$D592, SUMIFS($U$555:$U$589, $B$555:$B$589, $B592, $V$555:$V$589, \"*\"&\"Early\"&\"*\"), $D592)","v":0},{"$f":"+IF(SUMIFS($U$555:$U$589, $B$555:$B$589, $B592, $V$555:$V$589, \"*\"&\"Mid\"&\"*\") <=$D592, SUMIFS($U$555:$U$589, $B$555:$B$589, $B592, $V$555:$V$589, \"*\"&\"Mid\"&\"*\"), $D592)","v":0},{"$f":"+IF(SUMIFS($U$555:$U$589, $B$555:$B$589, $B592, $V$555:$V$589, \"*\"&\"Late\"&\"*\") <=$D592, SUMIFS($U$555:$U$589, $B$555:$B$589, $B592, $V$555:$V$589, \"*\"&\"Late\"&\"*\"), $D592)","v":0}," "]
[{"$f":"A556","v":8},2,null,{"$f":"+IF(ISNA(VLOOKUP(B593,B$555:D$589, 3, FALSE)),0,VLOOKUP(B593,B$555:D$589, 3, FALSE))","v":0},0,0,{"$f":"+IF(SUMIFS(T$555:T$589, B$555:B$589, $B593, $V$555:$V$589, \"*\"&\"Late\"&\"*\") <=$D593, SUMIFS(T$555:T$589,B$555:B$589, $B593,$V$555:$V$589, \"*\"&\"Late\"&\"*\"), $D593)","v":0},{"$f":"+IF(ISNA(VLOOKUP(B593,B$555:D$589, 3, FALSE)),0,VLOOKUP(B593,B$555:D$589, 3, FALSE))","v":0},{"$f":"+IF(SUMIFS($U$555:$U$589, $B$555:$B$589, $B593, $V$555:$V$589, \"*\"&\"Early\"&\"*\") <=$D593, SUMIFS($U$555:$U$589, $B$555:$B$589, $B593, $V$555:$V$589, \"*\"&\"Early\"&\"*\"), $D593)","v":0},{"$f":"+IF(SUMIFS($U$555:$U$589, $B$555:$B$589, $B593, $V$555:$V$589, \"*\"&\"Mid\"&\"*\") <=$D593, SUMIFS($U$555:$U$589, $B$555:$B$589, $B593, $V$555:$V$589, \"*\"&\"Mid\"&\"*\"), $D593)","v":0},{"$f":"+IF(SUMIFS($U$555:$U$589, $B$555:$B$589, $B593, $V$555:$V$589, \"*\"&\"Late\"&\"*\") <=$D593, SUMIFS($U$555:$U$589, $B$555:$B$589, $B593, $V$555:$V$589, \"*\"&\"Late\"&\"*\"), $D593)","v":0}," "]
[{"$f":"A557","v":8},3,null,0,0,0,0,0,0,0,0]
[{"$f":"A558","v":8},4,null,0,0,0,0,0,0,0,0]
[{"$f":"A559","v":8},5,null,0,0,0,0,0,0,0,0]
[{"$f":"A560","v":8},6,null,0,0,0,0,0,0,0,0]
[{"$f":"A561","v":8},7,null,0,0,0,0,0,0,0,0]
[{"$f":"A562","v":8},8,null,0,0,0,0,0,0,0,0]
[{"$f":"A563","v":8},9,null,0,0,0,0,0,0,0,0]
[{"$f":"A564","v":8},10,null,0,0,0,0,0,0,0,0]
[{"$f":"A565","v":8},11,null,{"$f":"+IF(ISNA(VLOOKUP(B602,B$555:D$589, 3, FALSE)),0,VLOOKUP(B602,B$555:D$589, 3, FALSE))","v":0},{"$f":"+IF(SUMIFS(T$477:T$511, B$555:B$589, $B602, V$555:V$589, \"*\"&\"Early\"&\"*\") <=$D602, SUMIFS(T$555:T$589, B$555:B$589, $B602, V$555:V$589, \"*\"&\"Early\"&\"*\"), $D602)","v":0},{"$f":"+IF(SUMIFS(T$477:T$511,B$555:B$589, $B602, V$555:V$589, \"*\"&\"Mid\"&\"*\") <=$D602, SUMIFS(T$555:T$589,B$555:B$589, $B602, V$555:V$589, \"*\"&\"Mid\"&\"*\"), $D602)","v":0},{"$f":"+IF(SUMIFS(T$555:T$589, B$555:B$589, $B602, $V$555:$V$589, \"*\"&\"Late\"&\"*\") <=$D602, SUMIFS(T$555:T$589,B$555:B$589, $B602,$V$555:$V$589, \"*\"&\"Late\"&\"*\"), $D602)","v":0},{"$f":"+IF(ISNA(VLOOKUP(B602,B$555:D$589, 3, FALSE)),0,VLOOKUP(B602,B$555:D$589, 3, FALSE))","v":0},0,0,0]
[{"$f":"A566","v":8},12,null,0,0,0,0,0,0,0,0]
[{"$f":"A567","v":8},13,null,0,0,0,0,0,0,0,0]
[{"$f":"A568","v":8},14,null,0,0,0,0,0,0,0,0]
[{"$f":"A569","v":8},15,null,0,0,0,0,0,0,0,0]
[{"$f":"A570","v":8},16,null,0,0,0,0,0,0,0,0]
[{"$f":"A571","v":8},17,null,0,0,0,0,0,0,0,0]
[{"$f":"A572","v":8},18,null,0,0,0,0,0,0,0,0]
[{"$f":"A573","v":8},19,null,0,0,0,0,0,0,0,0]
[{"$f":"A574","v":8},20,null,0,0,0,0,0,0,0,0]
[{"$f":"A575","v":8},21,null,0,0,0,0,0,0,0,0]
[{"$f":"A576","v":8},22,null,0,0,0,0,0,0,0,0]
[{"$f":"A577","v":8},23,null,0,0,0,0,0,0,0,0]
[{"$f":"A578","v":8},24,null,0,0,0,0,0,0,0,0]
[{"$f":"A579","v":8},25,null,0,0,0,0,0,0,0,0]
[{"$f":"A580","v":8},26,null,0,0,0,0,0,0,0,0]
[{"$f":"A581","v":8},27,null,0,0,0,0,0,0,0,0]
[{"$f":"A582","v":8},28,null,0,0,0,0,0,0,0,0]
[{"$f":"A583","v":8},29,null,0,0,0,0,0,0,0,0]
[{"$f":"A584","v":8},30,null,0,0,0,0,0,0,0,0]
[{"$f":"A585","v":8},31,null,0,0,0,0,0,0,0,0]
[{"$f":"A586","v":8},32,null,0,0,0,0,0,0,0,0]
[{"$f":"A587","v":8},33,null,0,0,0,0,0,0,0,0]
[{"$f":"A588","v":8},34,null,0,0,0,0,0,0,0,0]
[{"$f":"A589","v":8},35,null,0,0,0,0,0,0,0,0]
[{"$f":"A555","v":8},"Total",null,{"$f":"+SUM(D592:D626)","v":0},{"$f":"+SUM(E592:E626)","v":0},0,0,0,0,0,0,{"$f":"+X554","v":7},{"$f":"+Y554","v":10},{"$f":"+Z554","v":7}]
[null," ",null,{"$f":"D627","v":0},"Map Unit Size in Acres",null,{"$f":"FieldBeeForm!L14","v":20000},"Value entered in FieldBeeForm (Should be same as cell C428)"]
[]
["Enter only in yellow cells. Leave rest untouched.",null,null,null,null,null,"Enter the current year age in column G for each vegetation type. This age will be added to the assessment year (input on Field data form) to determine time series age in column K. If you are interested in just the current effects, enter a '0' in cell E11 of the Field data form."]
["Map Unit","Vegetation Entry","Map Unit Size","Spatial extent of Veg Type","Existing Cover Class for VegType","Species/ VegType","Existing Age of Average Plant \n(for S enter 1, for Sa enter 2, for P enter 3, for M enter 5, for D enter 10)","Species/Vegetation Type Descriptions","Ht Rate","Ht max","Future Age","Future Height","Canopy Width Max (m)","Canopy Width Rate","Existing Age canopy area per plant",null,"Estimated # Individuals","Future Horizontal Surface Area per plant (width x width)","Future Vertical Surface Area per plant (width x height)","Horizontal Surface Area Across Map Unit","Vertical Surface Area Across Map Unit","Season(s)","Season(s) (.)","Early","Mid","Late"]
["#","#"," sq ft","m2","%","code","yrs",null,"m/yr","m","yrs","m","m","m/yr","m2",null,"number","m2","m2","m2","m2",null,null,{"$f":"SUM(IF(FREQUENCY(MATCH(X633:X667, X633:X667,0),MATCH(X633:X667, X633:X667,0))>0,1))-1","v":7},{"$f":"SUM(IF(FREQUENCY(MATCH(Y633:Y667, Y633:Y667,0),MATCH(Y633:Y667, Y633:Y667,0))>0,1))-1","v":10},{"$f":"SUM(IF(FREQUENCY(MATCH(Z633:Z667, Z633:Z667,0),MATCH(Z633:Z667, Z633:Z667,0))>0,1))-1","v":7}]
[9,1,null,{"$f":"(0.092903*C633)*E633","v":0},0.06,1600,5,{"$f":"VLOOKUP(F633,VegTypeParameters!A:G,2,FALSE)","v":"Atriplex"},{"$f":"VLOOKUP($F633,VegTypeParameters!$A:$G,5,FALSE)","v":3.2962962962962963},{"$f":"VLOOKUP($F633,VegTypeParameters!$A:$G,4,FALSE)","v":3},{"$f":"G633+FieldBeeForm!$E$11","v":17},{"$f":"IF(J633>0,J633*(1-EXP(-I633*K633/J633)), 0)","v":2.9999999768298276},{"$f":"(VLOOKUP($F633,VegTypeParameters!A:G,6,FALSE))","v":5},{"$f":"(VLOOKUP($F633,VegTypeParameters!A:G,7,FALSE))","v":7.1111111111111107},{"$f":"IF(M633>0, (M633*(1-EXP(-N633*G633/M633)))*(M633*(1-EXP(-N633*G633/M633))),0)","v":24.959217254150069},null,{"$f":"IF(O633>0, (D633*E633)/O633,0)","v":0},{"$f":"IF(M633>0, (M633*(1-EXP(-N633*K633/M633)))*(M633*(1-EXP(-N633*K633/M633))), 0)","v":24.99999999841986},{"$f":"IF(M633>0,(M633*(1-EXP(-N633*K633/M633)))*L633,0)","v":14.999999883675097},{"$f":"R633*Q633","v":0},{"$f":"S633*Q633","v":0},{"$f":"VLOOKUP($F633,VegTypeParameters!$A:$H,8,FALSE)","v":"Mid/Late"},{"$f":"+IF(ISNA(V633), \".\",  V633)","v":"Mid/Late"},{"$f":"IF($W633=\"Early/Mid\",$H633,IF($W633=\"Early\", $H633, IF($W633=\"Early/Mid/Late\", $H633,\".\")))","v":"."},{"$f":"IF($W633=\"Early/Mid\",$H633,IF($W633=\"Mid\", $H633, IF($W633=\"Mid/Late\", $H633, IF($W633=\"Early/Mid/Late\", $H633,\".\"))))","v":"Atriplex"},{"$f":"IF($W633=\"Mid/Late\",$H633,IF($W633=\"Late\", $H633, IF($W633=\"Early/Mid/Late\", $H633,\".\")))","v":"Atriplex"}]
[9,2,{"$f":"+C$633","v":0},{"$f":"(0.092903*C634)*E634","v":0},0.03,4200,3,{"$f":"VLOOKUP(F634,VegTypeParameters!A:G,2,FALSE)","v":"Helianthus"},{"$f":"VLOOKUP($F634,VegTypeParameters!$A:$G,5,FALSE)","v":6.5},{"$f":"VLOOKUP($F634,VegTypeParameters!$A:$G,4,FALSE)","v":2.5},{"$f":"G634+FieldBeeForm!$E$11","v":15},2.5,{"$f":"(VLOOKUP($F634,VegTypeParameters!A:G,6,FALSE))","v":0.75},{"$f":"(VLOOKUP($F634,VegTypeParameters!A:G,7,FALSE))","v":1.25},0.55494534708652032,null,0,0.56249999998437616,1.8749999999739604,0,0,{"$f":"VLOOKUP($F634,VegTypeParameters!$A:$H,8,FALSE)","v":"Mid/Late"},{"$f":"+IF(ISNA(V634), \".\",  V634)","v":"Mid/Late"},{"$f":"IF($W634=\"Early/Mid\",$H634,IF($W634=\"Early\", $H634, IF($W634=\"Early/Mid/Late\", $H634,\".\")))","v":"."},{"$f":"IF($W634=\"Early/Mid\",$H634,IF($W634=\"Mid\", $H634, IF($W634=\"Mid/Late\", $H634, IF($W634=\"Early/Mid/Late\", $H634,\".\"))))","v":"Helianthus"},{"$f":"IF($W634=\"Mid/Late\",$H634,IF($W634=\"Late\", $H634, IF($W634=\"Early/Mid/Late\", $H634,\".\")))","v":"Helianthus"}]
[9,3,{"$f":"+C$633","v":0},0,0.08,4000,3,{"$f":"VLOOKUP(F635,VegTypeParameters!A:G,2,FALSE)","v":"Grindelia"},{"$f":"VLOOKUP($F635,VegTypeParameters!$A:$G,5,FALSE)","v":1.6666666666666667},{"$f":"VLOOKUP($F635,VegTypeParameters!$A:$G,4,FALSE)","v":2.5},{"$f":"G635+FieldBeeForm!$E$11","v":15},2.4998865001755939,{"$f":"(VLOOKUP($F635,VegTypeParameters!A:G,6,FALSE))","v":2},{"$f":"(VLOOKUP($F635,VegTypeParameters!A:G,7,FALSE))","v":1.3333333333333333},2.9905802896620353,null,0,3.9996368088065144,4.9995460110081433,0,0,{"$f":"VLOOKUP($F635,VegTypeParameters!$A:$H,8,FALSE)","v":"Mid/Late"},"Mid/Late",".","Grindelia","Grindelia"]
[9,4,0,0,0.08,7000,3,{"$f":"VLOOKUP(F636,VegTypeParameters!A:G,2,FALSE)","v":"Salix (shrub)"},{"$f":"VLOOKUP($F636,VegTypeParameters!$A:$G,5,FALSE)","v":0.73},{"$f":"VLOOKUP($F636,VegTypeParameters!$A:$G,4,FALSE)","v":3.5},{"$f":"G636+FieldBeeForm!$E$11","v":15},3.3467689644197414,{"$f":"(VLOOKUP($F636,VegTypeParameters!A:G,6,FALSE))","v":2.5},{"$f":"(VLOOKUP($F636,VegTypeParameters!A:G,7,FALSE))","v":0.55000000000000004},1.4589539561403246,null,0,5.7974627077191743,8.0583238111294335,0,0,{"$f":"VLOOKUP($F636,VegTypeParameters!$A:$H,8,FALSE)","v":"Early"},"Early","Salix (shrub)",".","."]
[9,5,0,0,0.08,8400,5,{"$f":"VLOOKUP(F637,VegTypeParameters!A:G,2,FALSE)","v":"Weeds, non-invasive and not beneficial to pollinators"},{"$f":"VLOOKUP($F637,VegTypeParameters!$A:$G,5,FALSE)","v":0},{"$f":"VLOOKUP($F637,VegTypeParameters!$A:$G,4,FALSE)","v":0},{"$f":"G637+FieldBeeForm!$E$11","v":17},0,{"$f":"(VLOOKUP($F637,VegTypeParameters!A:G,6,FALSE))","v":0},{"$f":"(VLOOKUP($F637,VegTypeParameters!A:G,7,FALSE))","v":0},0,null,0,0,0,0,0,{"$f":"VLOOKUP($F637,VegTypeParameters!$A:$H,8,FALSE)","v":"Never"},"Never",".",".","."]
[9,6,0,0,0.08,5300,3,{"$f":"VLOOKUP(F638,VegTypeParameters!A:G,2,FALSE)","v":"Medicago "},{"$f":"VLOOKUP($F638,VegTypeParameters!$A:$G,5,FALSE)","v":0.5},{"$f":"VLOOKUP($F638,VegTypeParameters!$A:$G,4,FALSE)","v":0.5},{"$f":"G638+FieldBeeForm!$E$11","v":15},0.49999984704883976,{"$f":"(VLOOKUP($F638,VegTypeParameters!A:G,6,FALSE))","v":0.7},{"$f":"(VLOOKUP($F638,VegTypeParameters!A:G,7,FALSE))","v":0.7},0.44242326156605982,null,0,0.48999970021577172,0.34999978586840841,0,0,{"$f":"VLOOKUP($F638,VegTypeParameters!$A:$H,8,FALSE)","v":"Mid/Late"},"Mid/Late",".","Medicago ","Medicago "]
[9,7,0,0,0.08,1600,3,{"$f":"VLOOKUP(F639,VegTypeParameters!A:G,2,FALSE)","v":"Atriplex"},{"$f":"VLOOKUP($F639,VegTypeParameters!$A:$G,5,FALSE)","v":3.2962962962962963},{"$f":"VLOOKUP($F639,VegTypeParameters!$A:$G,4,FALSE)","v":3},{"$f":"G639+FieldBeeForm!$E$11","v":15},2.999999791404568,{"$f":"(VLOOKUP($F639,VegTypeParameters!A:G,6,FALSE))","v":5},{"$f":"(VLOOKUP($F639,VegTypeParameters!A:G,7,FALSE))","v":7.1111111111111107},24.303496604054391,null,0,24.999999972834292,14.999998948873127,0,0,{"$f":"VLOOKUP($F639,VegTypeParameters!$A:$H,8,FALSE)","v":"Mid/Late"},"Mid/Late",".","Atriplex","Atriplex"]
[9,8,0,0,0.03,7500,3,{"$f":"VLOOKUP(F640,VegTypeParameters!A:G,2,FALSE)","v":"Scrophularia"},{"$f":"VLOOKUP($F640,VegTypeParameters!$A:$G,5,FALSE)","v":1.2},{"$f":"VLOOKUP($F640,VegTypeParameters!$A:$G,4,FALSE)","v":1.2},{"$f":"G640+FieldBeeForm!$E$11","v":15},1.1999996329172153,{"$f":"(VLOOKUP($F640,VegTypeParameters!A:G,6,FALSE))","v":0.3},{"$f":"(VLOOKUP($F640,VegTypeParameters!A:G,7,FALSE))","v":0.3},8.1261415389684455E-2,null,0,8.9999944937590726E-2,0.3599997797503629,0,0,{"$f":"VLOOKUP($F640,VegTypeParameters!$A:$H,8,FALSE)","v":"Early/Mid"},"Early/Mid","Scrophularia","Scrophularia","."]
[9,9,0,0,0.03,3500,3,{"$f":"VLOOKUP(F641,VegTypeParameters!A:G,2,FALSE)","v":"Ficus carica"},{"$f":"VLOOKUP($F641,VegTypeParameters!$A:$G,5,FALSE)","v":0},{"$f":"VLOOKUP($F641,VegTypeParameters!$A:$G,4,FALSE)","v":0},{"$f":"G641+FieldBeeForm!$E$11","v":15},0,{"$f":"(VLOOKUP($F641,VegTypeParameters!A:G,6,FALSE))","v":0},{"$f":"(VLOOKUP($F641,VegTypeParameters!A:G,7,FALSE))","v":0},0,null,0,0,0,0,0,{"$f":"VLOOKUP($F641,VegTypeParameters!$A:$H,8,FALSE)","v":"Never"},"Never",".",".","."]
[9,10,0,0,0.03,6200,3,{"$f":"VLOOKUP(F642,VegTypeParameters!A:G,2,FALSE)","v":"Other late blooming native plants beneficial to pollinators"},{"$f":"VLOOKUP($F642,VegTypeParameters!$A:$G,5,FALSE)","v":0.25},{"$f":"VLOOKUP($F642,VegTypeParameters!$A:$G,4,FALSE)","v":1},{"$f":"G642+FieldBeeForm!$E$11","v":15},0.97648225414399092,{"$f":"(VLOOKUP($F642,VegTypeParameters!A:G,6,FALSE))","v":0.5},{"$f":"(VLOOKUP($F642,VegTypeParameters!A:G,7,FALSE))","v":0.25},0.15088168701775109,null,0,0.24972353429050623,0.48797108853574861,0,0,{"$f":"VLOOKUP($F642,VegTypeParameters!$A:$H,8,FALSE)","v":"Late"},"Late",".",".","Other late blooming native plants beneficial to pollinators"]
[9,11,0,0,0.03,2500,3,{"$f":"VLOOKUP(F643,VegTypeParameters!A:G,2,FALSE)","v":"Clarkia"},{"$f":"VLOOKUP($F643,VegTypeParameters!$A:$G,5,FALSE)","v":0.4},{"$f":"VLOOKUP($F643,VegTypeParameters!$A:$G,4,FALSE)","v":0.4},{"$f":"G643+FieldBeeForm!$E$11","v":15},0.39999987763907185,{"$f":"(VLOOKUP($F643,VegTypeParameters!A:G,6,FALSE))","v":0.1},{"$f":"(VLOOKUP($F643,VegTypeParameters!A:G,7,FALSE))","v":0.1},9.029046154409387E-3,null,0,9.9999938819545289E-3,3.9999975527818116E-2,0,0,{"$f":"VLOOKUP($F643,VegTypeParameters!$A:$H,8,FALSE)","v":"Early/Mid"},"Early/Mid","Clarkia","Clarkia","."]
[9,12,0,0,0.08,5000,3,{"$f":"VLOOKUP(F644,VegTypeParameters!A:G,2,FALSE)","v":"Lupinus spp."},{"$f":"VLOOKUP($F644,VegTypeParameters!$A:$G,5,FALSE)","v":0.98000000000000009},{"$f":"VLOOKUP($F644,VegTypeParameters!$A:$G,4,FALSE)","v":3},{"$f":"G644+FieldBeeForm!$E$11","v":15},2.9776602507872267,{"$f":"(VLOOKUP($F644,VegTypeParameters!A:G,6,FALSE))","v":3},{"$f":"(VLOOKUP($F644,VegTypeParameters!A:G,7,FALSE))","v":1.08},3.925206627733659,null,0,8.9188851385636738,8.8926342217348378,0,0,{"$f":"VLOOKUP($F644,VegTypeParameters!$A:$H,8,FALSE)","v":"Early/Mid/Late"},"Early/Mid/Late","Lupinus spp.","Lupinus spp.","Lupinus spp."]
[9,13,0,0,0.08,6000,3,{"$f":"VLOOKUP(F645,VegTypeParameters!A:G,2,FALSE)","v":"Orchard"},{"$f":"VLOOKUP($F645,VegTypeParameters!$A:$G,5,FALSE)","v":0.5},{"$f":"VLOOKUP($F645,VegTypeParameters!$A:$G,4,FALSE)","v":10},{"$f":"G645+FieldBeeForm!$E$11","v":15},5.2763344725898529,{"$f":"(VLOOKUP($F645,VegTypeParameters!A:G,6,FALSE))","v":6},{"$f":"(VLOOKUP($F645,VegTypeParameters!A:G,7,FALSE))","v":0.5},1.7614473685136525,null,0,18.326714576526665,22.58783601812447,0,0,{"$f":"VLOOKUP($F645,VegTypeParameters!$A:$H,8,FALSE)","v":"Early"},"Early","Orchard",".","."]
[9,14,0,0,0.03,3300,5,{"$f":"VLOOKUP(F646,VegTypeParameters!A:G,2,FALSE)","v":"Eschscholzia"},{"$f":"VLOOKUP($F646,VegTypeParameters!$A:$G,5,FALSE)","v":0.6},{"$f":"VLOOKUP($F646,VegTypeParameters!$A:$G,4,FALSE)","v":0.3},{"$f":"G646+FieldBeeForm!$E$11","v":17},0.29999999999999949,{"$f":"(VLOOKUP($F646,VegTypeParameters!A:G,6,FALSE))","v":0.15},{"$f":"(VLOOKUP($F646,VegTypeParameters!A:G,7,FALSE))","v":0.3},2.2497957049536645E-2,null,0,2.2499999999999923E-2,4.4999999999999846E-2,0,0,{"$f":"VLOOKUP($F646,VegTypeParameters!$A:$H,8,FALSE)","v":"Early/Mid"},"Early/Mid","Eschscholzia","Eschscholzia","."]
[9,15,0,0,0.03,5600,3,{"$f":"VLOOKUP(F647,VegTypeParameters!A:G,2,FALSE)","v":"Native forbs and graminoids not beneficial to pollinators"},{"$f":"VLOOKUP($F647,VegTypeParameters!$A:$G,5,FALSE)","v":0},{"$f":"VLOOKUP($F647,VegTypeParameters!$A:$G,4,FALSE)","v":0},{"$f":"G647+FieldBeeForm!$E$11","v":15},{"$f":"IF(J647>0,J647*(1-EXP(-I647*K647/J647)), 0)","v":0},{"$f":"(VLOOKUP($F647,VegTypeParameters!A:G,6,FALSE))","v":0},{"$f":"(VLOOKUP($F647,VegTypeParameters!A:G,7,FALSE))","v":0},{"$f":"IF(M647>0, (M647*(1-EXP(-N647*G647/M647)))*(M647*(1-EXP(-N647*G647/M647))),0)","v":0},null,{"$f":"IF(O647>0, (D647*E647)/O647,0)","v":0},{"$f":"IF(M647>0, (M647*(1-EXP(-N647*K647/M647)))*(M647*(1-EXP(-N647*K647/M647))), 0)","v":0},{"$f":"IF(M647>0,(M647*(1-EXP(-N647*K647/M647)))*L647,0)","v":0},0,0,{"$f":"VLOOKUP($F647,VegTypeParameters!$A:$H,8,FALSE)","v":"Never"},"Never",".",".","."]
[9,16,0,0,0.08,3800,3,{"$f":"VLOOKUP(F648,VegTypeParameters!A:G,2,FALSE)","v":"Gilia"},{"$f":"VLOOKUP($F648,VegTypeParameters!$A:$G,5,FALSE)","v":0.6},{"$f":"VLOOKUP($F648,VegTypeParameters!$A:$G,4,FALSE)","v":0.3},{"$f":"G648+FieldBeeForm!$E$11","v":15},{"$f":"IF(J648>0,J648*(1-EXP(-I648*K648/J648)), 0)","v":0.2999999999999719},{"$f":"(VLOOKUP($F648,VegTypeParameters!A:G,6,FALSE))","v":0.15},{"$f":"(VLOOKUP($F648,VegTypeParameters!A:G,7,FALSE))","v":0.3},{"$f":"IF(M648>0, (M648*(1-EXP(-N648*G648/M648)))*(M648*(1-EXP(-N648*G648/M648))),0)","v":2.2388594396827964E-2},null,{"$f":"IF(O648>0, (D648*E648)/O648,0)","v":0},{"$f":"IF(M648>0, (M648*(1-EXP(-N648*K648/M648)))*(M648*(1-EXP(-N648*K648/M648))), 0)","v":2.2499999999995784E-2},{"$f":"IF(M648>0,(M648*(1-EXP(-N648*K648/M648)))*L648,0)","v":4.4999999999991568E-2},0,0,{"$f":"VLOOKUP($F648,VegTypeParameters!$A:$H,8,FALSE)","v":"Mid"},"Mid",".","Gilia","."]
[9,17,0,0,0.08,1500,3,{"$f":"VLOOKUP(F649,VegTypeParameters!A:G,2,FALSE)","v":"Asclepias"},{"$f":"VLOOKUP($F649,VegTypeParameters!$A:$G,5,FALSE)","v":0.8},{"$f":"VLOOKUP($F649,VegTypeParameters!$A:$G,4,FALSE)","v":0.8},{"$f":"G649+FieldBeeForm!$E$11","v":15},0.79999975527814371,{"$f":"(VLOOKUP($F649,VegTypeParameters!A:G,6,FALSE))","v":0.2},{"$f":"(VLOOKUP($F649,VegTypeParameters!A:G,7,FALSE))","v":0.2},3.6116184617637548E-2,null,0,3.9999975527818116E-2,0.15999990211127246,0,0,{"$f":"VLOOKUP($F649,VegTypeParameters!$A:$H,8,FALSE)","v":"Early/Mid/Late"},"Early/Mid/Late","Asclepias","Asclepias","Asclepias"]
[9,18,0,0,5.0000000000000001E-3,1600,1,{"$f":"VLOOKUP(F650,VegTypeParameters!A:G,2,FALSE)","v":"Atriplex"},{"$f":"VLOOKUP($F650,VegTypeParameters!$A:$G,5,FALSE)","v":3.2962962962962963},{"$f":"VLOOKUP($F650,VegTypeParameters!$A:$G,4,FALSE)","v":3},{"$f":"G650+FieldBeeForm!$E$11","v":13},2.9999981220660135,{"$f":"(VLOOKUP($F650,VegTypeParameters!A:G,6,FALSE))","v":5},{"$f":"(VLOOKUP($F650,VegTypeParameters!A:G,7,FALSE))","v":7.1111111111111107},14.395290762184326,null,0,24.999999532966985,14.999990470220251,0,0,{"$f":"VLOOKUP($F650,VegTypeParameters!$A:$H,8,FALSE)","v":"Mid/Late"},"Mid/Late",".","Atriplex","Atriplex"]
[9,19,0,0,null,null,null,{"$f":"VLOOKUP(F651,VegTypeParameters!A:G,2,FALSE)","v":{"$error":"#N/A"}},{"$f":"VLOOKUP($F651,VegTypeParameters!$A:$G,5,FALSE)","v":{"$error":"#N/A"}},{"$f":"VLOOKUP($F651,VegTypeParameters!$A:$G,4,FALSE)","v":{"$error":"#N/A"}},{"$f":"G651+FieldBeeForm!$E$11","v":12},{"$error":"#N/A"},{"$f":"(VLOOKUP($F651,VegTypeParameters!A:G,6,FALSE))","v":{"$error":"#N/A"}},{"$f":"(VLOOKUP($F651,VegTypeParameters!A:G,7,FALSE))","v":{"$error":"#N/A"}},{"$error":"#N/A"},null,{"$error":"#N/A"},{"$error":"#N/A"},{"$error":"#N/A"},{"$error":"#N/A"},{"$error":"#N/A"},{"$f":"VLOOKUP($F651,VegTypeParameters!$A:$H,8,FALSE)","v":{"$error":"#N/A"}},".",".",".","."]
[9,20,0,0,null,null,null,{"$f":"VLOOKUP(F652,VegTypeParameters!A:G,2,FALSE)","v":{"$error":"#N/A"}},{"$f":"VLOOKUP($F652,VegTypeParameters!$A:$G,5,FALSE)","v":{"$error":"#N/A"}},{"$f":"VLOOKUP($F652,VegTypeParameters!$A:$G,4,FALSE)","v":{"$error":"#N/A"}},{"$f":"G652+FieldBeeForm!$E$11","v":12},{"$error":"#N/A"},{"$f":"(VLOOKUP($F652,VegTypeParameters!A:G,6,FALSE))","v":{"$error":"#N/A"}},{"$f":"(VLOOKUP($F652,VegTypeParameters!A:G,7,FALSE))","v":{"$error":"#N/A"}},{"$error":"#N/A"},null,{"$error":"#N/A"},{"$error":"#N/A"},{"$error":"#N/A"},{"$error":"#N/A"},{"$error":"#N/A"},{"$f":"VLOOKUP($F652,VegTypeParameters!$A:$H,8,FALSE)","v":{"$error":"#N/A"}},".",".",".","."]
[9,21,0,0,null,null,null,{"$f":"VLOOKUP(F653,VegTypeParameters!A:G,2,FALSE)","v":{"$error":"#N/A"}},{"$f":"VLOOKUP($F653,VegTypeParameters!$A:$G,5,FALSE)","v":{"$error":"#N/A"}},{"$f":"VLOOKUP($F653,VegTypeParameters!$A:$G,4,FALSE)","v":{"$error":"#N/A"}},{"$f":"G653+FieldBeeForm!$E$11","v":12},{"$error":"#N/A"},{"$f":"(VLOOKUP($F653,VegTypeParameters!A:G,6,FALSE))","v":{"$error":"#N/A"}},{"$f":"(VLOOKUP($F653,VegTypeParameters!A:G,7,FALSE))","v":{"$error":"#N/A"}},{"$error":"#N/A"},null,{"$error":"#N/A"},{"$error":"#N/A"},{"$error":"#N/A"},{"$error":"#N/A"},{"$error":"#N/A"},{"$f":"VLOOKUP($F653,VegTypeParameters!$A:$H,8,FALSE)","v":{"$error":"#N/A"}},".",".",".","."]
[9,22,0,0,null,null,null,{"$f":"VLOOKUP(F654,VegTypeParameters!A:G,2,FALSE)","v":{"$error":"#N/A"}},{"$f":"VLOOKUP($F654,VegTypeParameters!$A:$G,5,FALSE)","v":{"$error":"#N/A"}},{"$f":"VLOOKUP($F654,VegTypeParameters!$A:$G,4,FALSE)","v":{"$error":"#N/A"}},{"$f":"G654+FieldBeeForm!$E$11","v":12},{"$error":"#N/A"},{"$f":"(VLOOKUP($F654,VegTypeParameters!A:G,6,FALSE))","v":{"$error":"#N/A"}},{"$f":"(VLOOKUP($F654,VegTypeParameters!A:G,7,FALSE))","v":{"$error":"#N/A"}},{"$error":"#N/A"},null,{"$error":"#N/A"},{"$error":"#N/A"},{"$error":"#N/A"},{"$error":"#N/A"},{"$error":"#N/A"},{"$f":"VLOOKUP($F654,VegTypeParameters!$A:$H,8,FALSE)","v":{"$error":"#N/A"}},".",".",".","."]
[9,23,0,0,null,null,null,{"$f":"VLOOKUP(F655,VegTypeParameters!A:G,2,FALSE)","v":{"$error":"#N/A"}},{"$f":"VLOOKUP($F655,VegTypeParameters!$A:$G,5,FALSE)","v":{"$error":"#N/A"}},{"$f":"VLOOKUP($F655,VegTypeParameters!$A:$G,4,FALSE)","v":{"$error":"#N/A"}},{"$f":"G655+FieldBeeForm!$E$11","v":12},{"$error":"#N/A"},{"$f":"(VLOOKUP($F655,VegTypeParameters!A:G,6,FALSE))","v":{"$error":"#N/A"}},{"$f":"(VLOOKUP($F655,VegTypeParameters!A:G,7,FALSE))","v":{"$error":"#N/A"}},{"$error":"#N/A"},null,{"$error":"#N/A"},{"$error":"#N/A"},{"$error":"#N/A"},{"$error":"#N/A"},{"$error":"#N/A"},{"$f":"VLOOKUP($F655,VegTypeParameters!$A:$H,8,FALSE)","v":{"$error":"#N/A"}},".",".",".","."]
[9,24,0,0,null,null,null,{"$f":"VLOOKUP(F656,VegTypeParameters!A:G,2,FALSE)","v":{"$error":"#N/A"}},{"$f":"VLOOKUP($F656,VegTypeParameters!$A:$G,5,FALSE)","v":{"$error":"#N/A"}},{"$f":"VLOOKUP($F656,VegTypeParameters!$A:$G,4,FALSE)","v":{"$error":"#N/A"}},{"$f":"G656+FieldBeeForm!$E$11","v":12},{"$error":"#N/A"},{"$f":"(VLOOKUP($F656,VegTypeParameters!A:G,6,FALSE))","v":{"$error":"#N/A"}},{"$f":"(VLOOKUP($F656,VegTypeParameters!A:G,7,FALSE))","v":{"$error":"#N/A"}},{"$error":"#N/A"},null,{"$error":"#N/A"},{"$error":"#N/A"},{"$error":"#N/A"},{"$error":"#N/A"},{"$error":"#N/A"},{"$f":"VLOOKUP($F656,VegTypeParameters!$A:$H,8,FALSE)","v":{"$error":"#N/A"}},".",".",".","."]
[9,25,0,0,null,null,null,{"$f":"VLOOKUP(F657,VegTypeParameters!A:G,2,FALSE)","v":{"$error":"#N/A"}},{"$f":"VLOOKUP($F657,VegTypeParameters!$A:$G,5,FALSE)","v":{"$error":"#N/A"}},{"$f":"VLOOKUP($F657,VegTypeParameters!$A:$G,4,FALSE)","v":{"$error":"#N/A"}},{"$f":"G657+FieldBeeForm!$E$11","v":12},{"$f":"IF(J657>0,J657*(1-EXP(-I657*K657/J657)), 0)","v":{"$error":"#N/A"}},{"$f":"(VLOOKUP($F657,VegTypeParameters!A:G,6,FALSE))","v":{"$error":"#N/A"}},{"$f":"(VLOOKUP($F657,VegTypeParameters!A:G,7,FALSE))","v":{"$error":"#N/A"}},{"$f":"IF(M657>0, (M657*(1-EXP(-N657*G657/M657)))*(M657*(1-EXP(-N657*G657/M657))),0)","v":{"$error":"#N/A"}},null,{"$f":"IF(O657>0, (D657*E657)/O657,0)","v":{"$error":"#N/A"}},{"$f":"IF(M657>0, (M657*(1-EXP(-N657*K657/M657)))*(M657*(1-EXP(-N657*K657/M657))), 0)","v":{"$error":"#N/A"}},{"$f":"IF(M657>0,(M657*(1-EXP(-N657*K657/M657)))*L657,0)","v":{"$error":"#N/A"}},{"$error":"#N/A"},{"$error":"#N/A"},{"$f":"VLOOKUP($F657,VegTypeParameters!$A:$H,8,FALSE)","v":{"$error":"#N/A"}},".",".",".","."]
[9,26,0,0,null,null,null,{"$f":"VLOOKUP(F658,VegTypeParameters!A:G,2,FALSE)","v":{"$error":"#N/A"}},{"$f":"VLOOKUP($F658,VegTypeParameters!$A:$G,5,FALSE)","v":{"$error":"#N/A"}},{"$f":"VLOOKUP($F658,VegTypeParameters!$A:$G,4,FALSE)","v":{"$error":"#N/A"}},{"$f":"G658+FieldBeeForm!$E$11","v":12},{"$f":"IF(J658>0,J658*(1-EXP(-I658*K658/J658)), 0)","v":{"$error":"#N/A"}},{"$f":"(VLOOKUP($F658,VegTypeParameters!A:G,6,FALSE))","v":{"$error":"#N/A"}},{"$f":"(VLOOKUP($F658,VegTypeParameters!A:G,7,FALSE))","v":{"$error":"#N/A"}},{"$f":"IF(M658>0, (M658*(1-EXP(-N658*G658/M658)))*(M658*(1-EXP(-N658*G658/M658))),0)","v":{"$error":"#N/A"}},null,{"$f":"IF(O658>0, (D658*E658)/O658,0)","v":{"$error":"#N/A"}},{"$f":"IF(M658>0, (M658*(1-EXP(-N658*K658/M658)))*(M658*(1-EXP(-N658*K658/M658))), 0)","v":{"$error":"#N/A"}},{"$f":"IF(M658>0,(M658*(1-EXP(-N658*K658/M658)))*L658,0)","v":{"$error":"#N/A"}},{"$error":"#N/A"},{"$error":"#N/A"},{"$f":"VLOOKUP($F658,VegTypeParameters!$A:$H,8,FALSE)","v":{"$error":"#N/A"}},".",".",".","."]
[9,27,0,0,null,null,null,{"$f":"VLOOKUP(F659,VegTypeParameters!A:G,2,FALSE)","v":{"$error":"#N/A"}},{"$f":"VLOOKUP($F659,VegTypeParameters!$A:$G,5,FALSE)","v":{"$error":"#N/A"}},{"$f":"VLOOKUP($F659,VegTypeParameters!$A:$G,4,FALSE)","v":{"$error":"#N/A"}},{"$f":"G659+FieldBeeForm!$E$11","v":12},{"$error":"#N/A"},{"$f":"(VLOOKUP($F659,VegTypeParameters!A:G,6,FALSE))","v":{"$error":"#N/A"}},{"$f":"(VLOOKUP($F659,VegTypeParameters!A:G,7,FALSE))","v":{"$error":"#N/A"}},{"$error":"#N/A"},null,{"$error":"#N/A"},{"$error":"#N/A"},{"$error":"#N/A"},{"$error":"#N/A"},{"$error":"#N/A"},{"$f":"VLOOKUP($F659,VegTypeParameters!$A:$H,8,FALSE)","v":{"$error":"#N/A"}},".",".",".","."]
[9,28,0,0,null,null,null,{"$f":"VLOOKUP(F660,VegTypeParameters!A:G,2,FALSE)","v":{"$error":"#N/A"}},{"$f":"VLOOKUP($F660,VegTypeParameters!$A:$G,5,FALSE)","v":{"$error":"#N/A"}},{"$f":"VLOOKUP($F660,VegTypeParameters!$A:$G,4,FALSE)","v":{"$error":"#N/A"}},{"$f":"G660+FieldBeeForm!$E$11","v":12},{"$error":"#N/A"},{"$f":"(VLOOKUP($F660,VegTypeParameters!A:G,6,FALSE))","v":{"$error":"#N/A"}},{"$f":"(VLOOKUP($F660,VegTypeParameters!A:G,7,FALSE))","v":{"$error":"#N/A"}},{"$error":"#N/A"},null,{"$error":"#N/A"},{"$error":"#N/A"},{"$error":"#N/A"},{"$error":"#N/A"},{"$error":"#N/A"},{"$f":"VLOOKUP($F660,VegTypeParameters!$A:$H,8,FALSE)","v":{"$error":"#N/A"}},".",".",".","."]
[9,29,0,0,null,null,null,{"$f":"VLOOKUP(F661,VegTypeParameters!A:G,2,FALSE)","v":{"$error":"#N/A"}},{"$f":"VLOOKUP($F661,VegTypeParameters!$A:$G,5,FALSE)","v":{"$error":"#N/A"}},{"$f":"VLOOKUP($F661,VegTypeParameters!$A:$G,4,FALSE)","v":{"$error":"#N/A"}},{"$f":"G661+FieldBeeForm!$E$11","v":12},{"$error":"#N/A"},{"$f":"(VLOOKUP($F661,VegTypeParameters!A:G,6,FALSE))","v":{"$error":"#N/A"}},{"$f":"(VLOOKUP($F661,VegTypeParameters!A:G,7,FALSE))","v":{"$error":"#N/A"}},{"$error":"#N/A"},null,{"$error":"#N/A"},{"$error":"#N/A"},{"$error":"#N/A"},{"$error":"#N/A"},{"$error":"#N/A"},{"$f":"VLOOKUP($F661,VegTypeParameters!$A:$H,8,FALSE)","v":{"$error":"#N/A"}},".",".",".","."]
[9,30,0,0,null,null,null,{"$f":"VLOOKUP(F662,VegTypeParameters!A:G,2,FALSE)","v":{"$error":"#N/A"}},{"$f":"VLOOKUP($F662,VegTypeParameters!$A:$G,5,FALSE)","v":{"$error":"#N/A"}},{"$f":"VLOOKUP($F662,VegTypeParameters!$A:$G,4,FALSE)","v":{"$error":"#N/A"}},{"$f":"G662+FieldBeeForm!$E$11","v":12},{"$error":"#N/A"},{"$f":"(VLOOKUP($F662,VegTypeParameters!A:G,6,FALSE))","v":{"$error":"#N/A"}},{"$f":"(VLOOKUP($F662,VegTypeParameters!A:G,7,FALSE))","v":{"$error":"#N/A"}},{"$error":"#N/A"},null,{"$error":"#N/A"},{"$error":"#N/A"},{"$error":"#N/A"},{"$error":"#N/A"},{"$error":"#N/A"},{"$f":"VLOOKUP($F662,VegTypeParameters!$A:$H,8,FALSE)","v":{"$error":"#N/A"}},".",".",".","."]
[9,31,0,0,null,null,null,{"$f":"VLOOKUP(F663,VegTypeParameters!A:G,2,FALSE)","v":{"$error":"#N/A"}},{"$f":"VLOOKUP($F663,VegTypeParameters!$A:$G,5,FALSE)","v":{"$error":"#N/A"}},{"$f":"VLOOKUP($F663,VegTypeParameters!$A:$G,4,FALSE)","v":{"$error":"#N/A"}},{"$f":"G663+FieldBeeForm!$E$11","v":12},{"$error":"#N/A"},{"$f":"(VLOOKUP($F663,VegTypeParameters!A:G,6,FALSE))","v":{"$error":"#N/A"}},{"$f":"(VLOOKUP($F663,VegTypeParameters!A:G,7,FALSE))","v":{"$error":"#N/A"}},{"$error":"#N/A"},null,{"$error":"#N/A"},{"$error":"#N/A"},{"$error":"#N/A"},{"$error":"#N/A"},{"$error":"#N/A"},{"$f":"VLOOKUP($F663,VegTypeParameters!$A:$H,8,FALSE)","v":{"$error":"#N/A"}},".",".",".","."]
[9,32,0,0,null,null,null,{"$f":"VLOOKUP(F664,VegTypeParameters!A:G,2,FALSE)","v":{"$error":"#N/A"}},{"$f":"VLOOKUP($F664,VegTypeParameters!$A:$G,5,FALSE)","v":{"$error":"#N/A"}},{"$f":"VLOOKUP($F664,VegTypeParameters!$A:$G,4,FALSE)","v":{"$error":"#N/A"}},{"$f":"G664+FieldBeeForm!$E$11","v":12},{"$error":"#N/A"},{"$f":"(VLOOKUP($F664,VegTypeParameters!A:G,6,FALSE))","v":{"$error":"#N/A"}},{"$f":"(VLOOKUP($F664,VegTypeParameters!A:G,7,FALSE))","v":{"$error":"#N/A"}},{"$error":"#N/A"},null,{"$error":"#N/A"},{"$error":"#N/A"},{"$error":"#N/A"},{"$error":"#N/A"},{"$error":"#N/A"},{"$f":"VLOOKUP($F664,VegTypeParameters!$A:$H,8,FALSE)","v":{"$error":"#N/A"}},".",".",".","."]
[9,33,0,0,null,null,null,{"$f":"VLOOKUP(F665,VegTypeParameters!A:G,2,FALSE)","v":{"$error":"#N/A"}},{"$f":"VLOOKUP($F665,VegTypeParameters!$A:$G,5,FALSE)","v":{"$error":"#N/A"}},{"$f":"VLOOKUP($F665,VegTypeParameters!$A:$G,4,FALSE)","v":{"$error":"#N/A"}},{"$f":"G665+FieldBeeForm!$E$11","v":12},{"$error":"#N/A"},{"$f":"(VLOOKUP($F665,VegTypeParameters!A:G,6,FALSE))","v":{"$error":"#N/A"}},{"$f":"(VLOOKUP($F665,VegTypeParameters!A:G,7,FALSE))","v":{"$error":"#N/A"}},{"$error":"#N/A"},null,{"$error":"#N/A"},{"$error":"#N/A"},{"$error":"#N/A"},{"$error":"#N/A"},{"$error":"#N/A"},{"$f":"VLOOKUP($F665,VegTypeParameters!$A:$H,8,FALSE)","v":{"$error":"#N/A"}},".",".",".","."]
[9,34,0,0,null,null,null,{"$f":"VLOOKUP(F666,VegTypeParameters!A:G,2,FALSE)","v":{"$error":"#N/A"}},{"$f":"VLOOKUP($F666,VegTypeParameters!$A:$G,5,FALSE)","v":{"$error":"#N/A"}},{"$f":"VLOOKUP($F666,VegTypeParameters!$A:$G,4,FALSE)","v":{"$error":"#N/A"}},{"$f":"G666+FieldBeeForm!$E$11","v":12},{"$error":"#N/A"},{"$f":"(VLOOKUP($F666,VegTypeParameters!A:G,6,FALSE))","v":{"$error":"#N/A"}},{"$f":"(VLOOKUP($F666,VegTypeParameters!A:G,7,FALSE))","v":{"$error":"#N/A"}},{"$error":"#N/A"},null,{"$error":"#N/A"},{"$error":"#N/A"},{"$error":"#N/A"},{"$error":"#N/A"},{"$error":"#N/A"},{"$f":"VLOOKUP($F666,VegTypeParameters!$A:$H,8,FALSE)","v":{"$error":"#N/A"}},".",".",".","."]
[9,35,0,0,null,null,null,{"$f":"VLOOKUP(F667,VegTypeParameters!A:G,2,FALSE)","v":{"$error":"#N/A"}},{"$f":"VLOOKUP($F667,VegTypeParameters!$A:$G,5,FALSE)","v":{"$error":"#N/A"}},{"$f":"VLOOKUP($F667,VegTypeParameters!$A:$G,4,FALSE)","v":{"$error":"#N/A"}},{"$f":"G667+FieldBeeForm!$E$11","v":12},{"$error":"#N/A"},{"$f":"(VLOOKUP($F667,VegTypeParameters!A:G,6,FALSE))","v":{"$error":"#N/A"}},{"$f":"(VLOOKUP($F667,VegTypeParameters!A:G,7,FALSE))","v":{"$error":"#N/A"}},{"$error":"#N/A"},null,{"$error":"#N/A"},{"$error":"#N/A"},{"$error":"#N/A"},{"$error":"#N/A"},{"$error":"#N/A"},{"$f":"VLOOKUP($F667,VegTypeParameters!$A:$H,8,FALSE)","v":{"$error":"#N/A"}},".",".",".","."]
[null,null,null,"Horizontal extent of pollinator plant cover (m2) per season",null,null,null,"Vertical extent of pollinator plant cover (m2) per season",null,null,null,"Number of different pollinator plant species per season"]
["Map Unit #","Vegetation Entry",null,"Spatial extent of Veg Type (m2)","Early","Mid","Late","Spatial extent of Veg Type (m2)","Early","Mid","Late","Early","Mid","Late"]
[{"$f":"A633","v":9},{"$f":"B633","v":1},null,{"$f":"+IF(ISNA(VLOOKUP(B670,B$633:D$667, 3, FALSE)),0,VLOOKUP(B670,B$633:D$667, 3, FALSE))","v":0},{"$f":"+IF(SUMIFS(T$633:T$667, B$633:B$667, $B670, V$633:V$667, \"*\"&\"Early\"&\"*\") <=$D670, SUMIFS(T$633:T$667, B$633:B$667, $B670, V$633:V$667, \"*\"&\"Early\"&\"*\"), $D670)","v":0},{"$f":"+IF(SUMIFS(T$633:T$667,B$633:B$667, $B670, V$633:V$667, \"*\"&\"Mid\"&\"*\") <=$D670, SUMIFS(T$633:T$667,B$633:B$667, $B670, V$633:V$667, \"*\"&\"Mid\"&\"*\"), $D670)","v":0},{"$f":"+IF(SUMIFS(T$633:T$667, B$633:B$667, $B670, $V$633:$V$667, \"*\"&\"Late\"&\"*\") <=$D670, SUMIFS(T$633:T$667,B$633:B$667, $B670,$V$633:$V$667, \"*\"&\"Late\"&\"*\"), $D670)","v":0},{"$f":"+IF(ISNA(VLOOKUP(B670,B$633:D$667,3, FALSE)),0,VLOOKUP(B670,B$633:D$667, 3, FALSE))","v":0},{"$f":"+IF(SUMIFS($U$633:$U$667, $B$633:$B$667, $B670, $V$633:$V$667, \"*\"&\"Early\"&\"*\") <=$D670, SUMIFS($U$633:$U$667, $B$633:$B$667, $B670, $V$633:$V$667, \"*\"&\"Early\"&\"*\"), $D670)","v":0},{"$f":"+IF(SUMIFS($U$633:$U$667, $B$633:$B$667, $B670, $V$633:$V$667, \"*\"&\"Mid\"&\"*\") <=$D670, SUMIFS($U$633:$U$667, $B$633:$B$667, $B670, $V$633:$V$667, \"*\"&\"Mid\"&\"*\"), $D670)","v":0},{"$f":"+IF(SUMIFS($U$633:$U$667, $B$633:$B$667, $B670, $V$633:$V$667, \"*\"&\"Late\"&\"*\") <=$D670, SUMIFS($U$633:$U$667, $B$633:$B$667, $B670, $V$633:$V$667, \"*\"&\"Late\"&\"*\"), $D670)","v":0}," "]
[{"$f":"A634","v":9},2,null,{"$f":"+IF(ISNA(VLOOKUP(B671,B$633:D$667, 3, FALSE)),0,VLOOKUP(B671,B$633:D$667, 3, FALSE))","v":0},{"$f":"+IF(SUMIFS(T$633:T$667, B$633:B$667, $B671, V$633:V$667, \"*\"&\"Early\"&\"*\") <=$D671, SUMIFS(T$633:T$667, B$633:B$667, $B671, V$633:V$667, \"*\"&\"Early\"&\"*\"), $D671)","v":0},{"$f":"+IF(SUMIFS(T$633:T$667,B$633:B$667, $B671, V$633:V$667, \"*\"&\"Mid\"&\"*\") <=$D671, SUMIFS(T$633:T$667,B$633:B$667, $B671, V$633:V$667, \"*\"&\"Mid\"&\"*\"), $D671)","v":0},{"$f":"+IF(SUMIFS(T$633:T$667, B$633:B$667, $B671, $V$633:$V$667, \"*\"&\"Late\"&\"*\") <=$D671, SUMIFS(T$633:T$667,B$633:B$667, $B671,$V$633:$V$667, \"*\"&\"Late\"&\"*\"), $D671)","v":0},{"$f":"+IF(ISNA(VLOOKUP(B671,B$633:D$667,3, FALSE)),0,VLOOKUP(B671,B$633:D$667, 3, FALSE))","v":0},{"$f":"+IF(SUMIFS($U$633:$U$667, $B$633:$B$667, $B671, $V$633:$V$667, \"*\"&\"Early\"&\"*\") <=$D671, SUMIFS($U$633:$U$667, $B$633:$B$667, $B671, $V$633:$V$667, \"*\"&\"Early\"&\"*\"), $D671)","v":0},{"$f":"+IF(SUMIFS($U$633:$U$667, $B$633:$B$667, $B671, $V$633:$V$667, \"*\"&\"Mid\"&\"*\") <=$D671, SUMIFS($U$633:$U$667, $B$633:$B$667, $B671, $V$633:$V$667, \"*\"&\"Mid\"&\"*\"), $D671)","v":0},{"$f":"+IF(SUMIFS($U$633:$U$667, $B$633:$B$667, $B671, $V$633:$V$667, \"*\"&\"Late\"&\"*\") <=$D671, SUMIFS($U$633:$U$667, $B$633:$B$667, $B671, $V$633:$V$667, \"*\"&\"Late\"&\"*\"), $D671)","v":0}," "]
[{"$f":"A635","v":9},3,null,0,0,0,0,0,0,0,0]
[{"$f":"A636","v":9},4,null,0,0,0,0,0,0,0,0]
[{"$f":"A637","v":9},5,null,0,0,0,0,0,0,0,0]
[{"$f":"A638","v":9},6,null,0,0,0,0,0,0,0,0]
[{"$f":"A639","v":9},7,null,0,0,0,0,0,0,0,0]
[{"$f":"A640","v":9},8,null,0,0,0,0,0,0,0,0]
[{"$f":"A641","v":9},9,null,0,0,0,0,0,0,0,0]
[{"$f":"A642","v":9},10,null,0,0,0,0,0,{"$f":"+IF(SUMIFS($U$633:$U$667, $B$633:$B$667, $B679, $V$633:$V$667, \"*\"&\"Early\"&\"*\") <=$D679, SUMIFS($U$633:$U$667, $B$633:$B$667, $B679, $V$633:$V$667, \"*\"&\"Early\"&\"*\"), $D679)","v":0},0,0]
[{"$f":"A643","v":9},11,null,{"$f":"+IF(ISNA(VLOOKUP(B680,B$633:D$667, 3, FALSE)),0,VLOOKUP(B680,B$633:D$667, 3, FALSE))","v":0},{"$f":"+IF(SUMIFS(T$633:T$667, B$633:B$667, $B680, V$633:V$667, \"*\"&\"Early\"&\"*\") <=$D680, SUMIFS(T$633:T$667, B$633:B$667, $B680, V$633:V$667, \"*\"&\"Early\"&\"*\"), $D680)","v":0},{"$f":"+IF(SUMIFS(T$633:T$667,B$633:B$667, $B680, V$633:V$667, \"*\"&\"Mid\"&\"*\") <=$D680, SUMIFS(T$633:T$667,B$633:B$667, $B680, V$633:V$667, \"*\"&\"Mid\"&\"*\"), $D680)","v":0},{"$f":"+IF(SUMIFS(T$633:T$667, B$633:B$667, $B680, $V$633:$V$667, \"*\"&\"Late\"&\"*\") <=$D680, SUMIFS(T$633:T$667,B$633:B$667, $B680,$V$633:$V$667, \"*\"&\"Late\"&\"*\"), $D680)","v":0},{"$f":"+IF(ISNA(VLOOKUP(B680,B$633:D$667,3, FALSE)),0,VLOOKUP(B680,B$633:D$667, 3, FALSE))","v":0},{"$f":"+IF(SUMIFS($U$633:$U$667, $B$633:$B$667, $B680, $V$633:$V$667, \"*\"&\"Early\"&\"*\") <=$D680, SUMIFS($U$633:$U$667, $B$633:$B$667, $B680, $V$633:$V$667, \"*\"&\"Early\"&\"*\"), $D680)","v":0},0,0]
[{"$f":"A644","v":9},12,null,0,0,0,0,0,0,0,0]
[{"$f":"A645","v":9},13,null,0,0,0,0,0,0,0,0]
[{"$f":"A646","v":9},14,null,0,0,0,0,0,0,0,0]
[{"$f":"A647","v":9},15,null,0,0,0,0,0,0,0,0]
[{"$f":"A648","v":9},16,null,0,0,0,0,0,0,0,0]
[{"$f":"A649","v":9},17,null,0,0,0,0,0,0,0,0]
[{"$f":"A650","v":9},18,null,0,0,0,0,0,0,0,0]
[{"$f":"A651","v":9},19,null,0,0,0,0,0,0,0,0]
[{"$f":"A652","v":9},20,null,0,0,0,0,0,0,0,0]
[{"$f":"A653","v":9},21,null,0,0,0,0,0,0,0,0]
[{"$f":"A654","v":9},22,null,0,0,0,0,0,0,0,0]
[{"$f":"A655","v":9},23,null,0,0,0,0,0,0,0,0]
[{"$f":"A656","v":9},24,null,0,0,0,0,0,0,0,0]
[{"$f":"A657","v":9},25,null,0,0,0,0,0,0,0,0]
[{"$f":"A658","v":9},26,null,0,0,0,0,0,0,0,0]
[{"$f":"A659","v":9},27,null,0,0,0,0,0,0,0,0]
[{"$f":"A660","v":9},28,null,0,0,0,0,0,0,0,0]
[{"$f":"A661","v":9},29,null,0,0,0,0,0,0,0,0]
[{"$f":"A662","v":9},30,null,0,0,0,0,0,0,0,0]
[{"$f":"A663","v":9},31,null,0,0,0,0,0,0,0,0]
[{"$f":"A664","v":9},32,null,0,0,0,0,0,0,0,0]
[{"$f":"A665","v":9},33,null,0,0,0,0,0,0,0,0]
[{"$f":"A666","v":9},34,null,0,0,0,0,0,0,0,0]
[{"$f":"A667","v":9},35,null,0,0,0,0,0,0,0,0]
[{"$f":"A633","v":9},"Total",null,{"$f":"+SUM(D670:D704)","v":0},{"$f":"+SUM(E670:E704)","v":0},0,0,0,0,0,0,{"$f":"+X632","v":7},{"$f":"+Y632","v":10},{"$f":"+Z632","v":7}]
[null," ",null,{"$f":"D705","v":0},"Map Unit Size in Acres",null,{"$f":"FieldBeeForm!M14","v":20000},"Value entered in FieldBeeForm (Should be same as cell C481)"]
[]
["Enter only in yellow cells. Leave rest untouched.",null,null,null,null,null,"Enter the current year age in column G for each vegetation type. This age will be added to the assessment year (input on Field data form) to determine time series age in column K. If you are interested in just the current effects, enter a '0' in cell E11 of the Field data form."]
["Map Unit","Vegetation Entry","Map Unit Size","Spatial extent of Veg Type","Existing Cover Class for VegType","Species/ VegType","Existing Age of Average Plant \n(for S enter 1, for Sa enter 2, for P enter 3, for M enter 5, for D enter 10)","Species/Vegetation Type Descriptions","Ht Rate","Ht max","Future Age","Future Height","Canopy Width Max (m)","Canopy Width Rate","Existing Age canopy area per plant",null,"Estimated # Individuals","Future Horizontal Surface Area per plant (width x width)","Future Vertical Surface Area per plant (width x height)","Horizontal Surface Area Across Map Unit","Vertical Surface Area Across Map Unit","Season(s)","Season(s) (.)","Early","Mid","Late"]
["#","#"," sq ft","m2","%","code","yrs",null,"m/yr","m","yrs","m","m","m/yr","m2",null,"number","m2","m2","m2","m2",null,null,{"$f":"SUM(IF(FREQUENCY(MATCH(X711:X745, X711:X745,0),MATCH(X711:X745, X711:X745,0))>0,1))-1","v":7},{"$f":"SUM(IF(FREQUENCY(MATCH(Y711:Y745, Y711:Y745,0),MATCH(Y711:Y745, Y711:Y745,0))>0,1))-1","v":10},{"$f":"SUM(IF(FREQUENCY(MATCH(Z711:Z745, Z711:Z745,0),MATCH(Z711:Z745, Z711:Z745,0))>0,1))-1","v":7}]
[10,1,null,{"$f":"(0.092903*C711)*E711","v":0},0.06,1600,5,{"$f":"VLOOKUP(F711,VegTypeParameters!A:G,2,FALSE)","v":"Atriplex"},{"$f":"VLOOKUP($F711,VegTypeParameters!$A:$G,5,FALSE)","v":3.2962962962962963},{"$f":"VLOOKUP($F711,VegTypeParameters!$A:$G,4,FALSE)","v":3},{"$f":"G711+FieldBeeForm!$E$11","v":17},{"$f":"IF(J711>0,J711*(1-EXP(-I711*K711/J711)), 0)","v":2.9999999768298276},{"$f":"(VLOOKUP($F711,VegTypeParameters!A:G,6,FALSE))","v":5},{"$f":"(VLOOKUP($F711,VegTypeParameters!A:G,7,FALSE))","v":7.1111111111111107},{"$f":"IF(M711>0, (M711*(1-EXP(-N711*G711/M711)))*(M711*(1-EXP(-N711*G711/M711))),0)","v":24.959217254150069},null,{"$f":"IF(O711>0, (D711*E711)/O711,0)","v":0},{"$f":"IF(M711>0, (M711*(1-EXP(-N711*K711/M711)))*(M711*(1-EXP(-N711*K711/M711))), 0)","v":24.99999999841986},{"$f":"IF(M711>0,(M711*(1-EXP(-N711*K711/M711)))*L711,0)","v":14.999999883675097},{"$f":"R711*Q711","v":0},{"$f":"S711*Q711","v":0},{"$f":"VLOOKUP($F711,VegTypeParameters!$A:$H,8,FALSE)","v":"Mid/Late"},{"$f":"+IF(ISNA(V711), \".\",  V711)","v":"Mid/Late"},{"$f":"IF($W711=\"Early/Mid\",$H711,IF($W711=\"Early\", $H711, IF($W711=\"Early/Mid/Late\", $H711,\".\")))","v":"."},{"$f":"IF($W711=\"Early/Mid\",$H711,IF($W711=\"Mid\", $H711, IF($W711=\"Mid/Late\", $H711, IF($W711=\"Early/Mid/Late\", $H711,\".\"))))","v":"Atriplex"},{"$f":"IF($W711=\"Mid/Late\",$H711,IF($W711=\"Late\", $H711, IF($W711=\"Early/Mid/Late\", $H711,\".\")))","v":"Atriplex"}]
[10,2,{"$f":"C$711","v":0},{"$f":"(0.092903*C712)*E712","v":0},0.03,4200,3,{"$f":"VLOOKUP(F712,VegTypeParameters!A:G,2,FALSE)","v":"Helianthus"},{"$f":"VLOOKUP($F712,VegTypeParameters!$A:$G,5,FALSE)","v":6.5},{"$f":"VLOOKUP($F712,VegTypeParameters!$A:$G,4,FALSE)","v":2.5},{"$f":"G712+FieldBeeForm!$E$11","v":15},2.5,{"$f":"(VLOOKUP($F712,VegTypeParameters!A:G,6,FALSE))","v":0.75},{"$f":"(VLOOKUP($F712,VegTypeParameters!A:G,7,FALSE))","v":1.25},0.55494534708652032,null,0,0.56249999998437616,1.8749999999739604,0,0,{"$f":"VLOOKUP($F712,VegTypeParameters!$A:$H,8,FALSE)","v":"Mid/Late"},{"$f":"+IF(ISNA(V712), \".\",  V712)","v":"Mid/Late"},{"$f":"IF($W712=\"Early/Mid\",$H712,IF($W712=\"Early\", $H712, IF($W712=\"Early/Mid/Late\", $H712,\".\")))","v":"."},{"$f":"IF($W712=\"Early/Mid\",$H712,IF($W712=\"Mid\", $H712, IF($W712=\"Mid/Late\", $H712, IF($W712=\"Early/Mid/Late\", $H712,\".\"))))","v":"Helianthus"},{"$f":"IF($W712=\"Mid/Late\",$H712,IF($W712=\"Late\", $H712, IF($W712=\"Early/Mid/Late\", $H712,\".\")))","v":"Helianthus"}]
[10,3,{"$f":"C$711","v":0},0,0.08,4000,3,{"$f":"VLOOKUP(F713,VegTypeParameters!A:G,2,FALSE)","v":"Grindelia"},{"$f":"VLOOKUP($F713,VegTypeParameters!$A:$G,5,FALSE)","v":1.6666666666666667},{"$f":"VLOOKUP($F713,VegTypeParameters!$A:$G,4,FALSE)","v":2.5},{"$f":"G713+FieldBeeForm!$E$11","v":15},2.4998865001755939,{"$f":"(VLOOKUP($F713,VegTypeParameters!A:G,6,FALSE))","v":2},{"$f":"(VLOOKUP($F713,VegTypeParameters!A:G,7,FALSE))","v":1.3333333333333333},2.9905802896620353,null,0,3.9996368088065144,4.9995460110081433,0,0,{"$f":"VLOOKUP($F713,VegTypeParameters!$A:$H,8,FALSE)","v":"Mid/Late"},"Mid/Late",".","Grindelia","Grindelia"]
[10,4,0,0,0.08,7000,3,{"$f":"VLOOKUP(F714,VegTypeParameters!A:G,2,FALSE)","v":"Salix (shrub)"},{"$f":"VLOOKUP($F714,VegTypeParameters!$A:$G,5,FALSE)","v":0.73},{"$f":"VLOOKUP($F714,VegTypeParameters!$A:$G,4,FALSE)","v":3.5},{"$f":"G714+FieldBeeForm!$E$11","v":15},3.3467689644197414,{"$f":"(VLOOKUP($F714,VegTypeParameters!A:G,6,FALSE))","v":2.5},{"$f":"(VLOOKUP($F714,VegTypeParameters!A:G,7,FALSE))","v":0.55000000000000004},1.4589539561403246,null,0,5.7974627077191743,8.0583238111294335,0,0,{"$f":"VLOOKUP($F714,VegTypeParameters!$A:$H,8,FALSE)","v":"Early"},"Early","Salix (shrub)",".","."]
[10,5,0,0,0.08,8400,5,{"$f":"VLOOKUP(F715,VegTypeParameters!A:G,2,FALSE)","v":"Weeds, non-invasive and not beneficial to pollinators"},{"$f":"VLOOKUP($F715,VegTypeParameters!$A:$G,5,FALSE)","v":0},{"$f":"VLOOKUP($F715,VegTypeParameters!$A:$G,4,FALSE)","v":0},{"$f":"G715+FieldBeeForm!$E$11","v":17},0,{"$f":"(VLOOKUP($F715,VegTypeParameters!A:G,6,FALSE))","v":0},{"$f":"(VLOOKUP($F715,VegTypeParameters!A:G,7,FALSE))","v":0},0,null,0,0,0,0,0,{"$f":"VLOOKUP($F715,VegTypeParameters!$A:$H,8,FALSE)","v":"Never"},"Never",".",".","."]
[10,6,0,0,0.08,5300,3,{"$f":"VLOOKUP(F716,VegTypeParameters!A:G,2,FALSE)","v":"Medicago "},{"$f":"VLOOKUP($F716,VegTypeParameters!$A:$G,5,FALSE)","v":0.5},{"$f":"VLOOKUP($F716,VegTypeParameters!$A:$G,4,FALSE)","v":0.5},{"$f":"G716+FieldBeeForm!$E$11","v":15},0.49999984704883976,{"$f":"(VLOOKUP($F716,VegTypeParameters!A:G,6,FALSE))","v":0.7},{"$f":"(VLOOKUP($F716,VegTypeParameters!A:G,7,FALSE))","v":0.7},0.44242326156605982,null,0,0.48999970021577172,0.34999978586840841,0,0,{"$f":"VLOOKUP($F716,VegTypeParameters!$A:$H,8,FALSE)","v":"Mid/Late"},"Mid/Late",".","Medicago ","Medicago "]
[10,7,0,0,0.08,1600,3,{"$f":"VLOOKUP(F717,VegTypeParameters!A:G,2,FALSE)","v":"Atriplex"},{"$f":"VLOOKUP($F717,VegTypeParameters!$A:$G,5,FALSE)","v":3.2962962962962963},{"$f":"VLOOKUP($F717,VegTypeParameters!$A:$G,4,FALSE)","v":3},{"$f":"G717+FieldBeeForm!$E$11","v":15},2.999999791404568,{"$f":"(VLOOKUP($F717,VegTypeParameters!A:G,6,FALSE))","v":5},{"$f":"(VLOOKUP($F717,VegTypeParameters!A:G,7,FALSE))","v":7.1111111111111107},24.303496604054391,null,0,24.999999972834292,14.999998948873127,0,0,{"$f":"VLOOKUP($F717,VegTypeParameters!$A:$H,8,FALSE)","v":"Mid/Late"},"Mid/Late",".","Atriplex","Atriplex"]
[10,8,0,0,0.03,7500,3,{"$f":"VLOOKUP(F718,VegTypeParameters!A:G,2,FALSE)","v":"Scrophularia"},{"$f":"VLOOKUP($F718,VegTypeParameters!$A:$G,5,FALSE)","v":1.2},{"$f":"VLOOKUP($F718,VegTypeParameters!$A:$G,4,FALSE)","v":1.2},{"$f":"G718+FieldBeeForm!$E$11","v":15},1.1999996329172153,{"$f":"(VLOOKUP($F718,VegTypeParameters!A:G,6,FALSE))","v":0.3},{"$f":"(VLOOKUP($F718,VegTypeParameters!A:G,7,FALSE))","v":0.3},8.1261415389684455E-2,null,0,8.9999944937590726E-2,0.3599997797503629,0,0,{"$f":"VLOOKUP($F718,VegTypeParameters!$A:$H,8,FALSE)","v":"Early/Mid"},"Early/Mid","Scrophularia","Scrophularia","."]
[10,9,0,0,0.03,3500,3,{"$f":"VLOOKUP(F719,VegTypeParameters!A:G,2,FALSE)","v":"Ficus carica"},{"$f":"VLOOKUP($F719,VegTypeParameters!$A:$G,5,FALSE)","v":0},{"$f":"VLOOKUP($F719,VegTypeParameters!$A:$G,4,FALSE)","v":0},{"$f":"G719+FieldBeeForm!$E$11","v":15},0,{"$f":"(VLOOKUP($F719,VegTypeParameters!A:G,6,FALSE))","v":0},{"$f":"(VLOOKUP($F719,VegTypeParameters!A:G,7,FALSE))","v":0},0,null,0,0,0,0,0,{"$f":"VLOOKUP($F719,VegTypeParameters!$A:$H,8,FALSE)","v":"Never"},"Never",".",".","."]
[10,10,0,0,0.03,6200,3,{"$f":"VLOOKUP(F720,VegTypeParameters!A:G,2,FALSE)","v":"Other late blooming native plants beneficial to pollinators"},{"$f":"VLOOKUP($F720,VegTypeParameters!$A:$G,5,FALSE)","v":0.25},{"$f":"VLOOKUP($F720,VegTypeParameters!$A:$G,4,FALSE)","v":1},{"$f":"G720+FieldBeeForm!$E$11","v":15},0.97648225414399092,{"$f":"(VLOOKUP($F720,VegTypeParameters!A:G,6,FALSE))","v":0.5},{"$f":"(VLOOKUP($F720,VegTypeParameters!A:G,7,FALSE))","v":0.25},0.15088168701775109,null,0,0.24972353429050623,0.48797108853574861,0,0,{"$f":"VLOOKUP($F720,VegTypeParameters!$A:$H,8,FALSE)","v":"Late"},"Late",".",".","Other late blooming native plants beneficial to pollinators"]
[10,11,0,0,0.03,2500,3,{"$f":"VLOOKUP(F721,VegTypeParameters!A:G,2,FALSE)","v":"Clarkia"},{"$f":"VLOOKUP($F721,VegTypeParameters!$A:$G,5,FALSE)","v":0.4},{"$f":"VLOOKUP($F721,VegTypeParameters!$A:$G,4,FALSE)","v":0.4},{"$f":"G721+FieldBeeForm!$E$11","v":15},0.39999987763907185,{"$f":"(VLOOKUP($F721,VegTypeParameters!A:G,6,FALSE))","v":0.1},{"$f":"(VLOOKUP($F721,VegTypeParameters!A:G,7,FALSE))","v":0.1},9.029046154409387E-3,null,0,9.9999938819545289E-3,3.9999975527818116E-2,0,0,{"$f":"VLOOKUP($F721,VegTypeParameters!$A:$H,8,FALSE)","v":"Early/Mid"},"Early/Mid","Clarkia","Clarkia","."]
[10,12,0,0,0.08,5000,3,{"$f":"VLOOKUP(F722,VegTypeParameters!A:G,2,FALSE)","v":"Lupinus spp."},{"$f":"VLOOKUP($F722,VegTypeParameters!$A:$G,5,FALSE)","v":0.98000000000000009},{"$f":"VLOOKUP($F722,VegTypeParameters!$A:$G,4,FALSE)","v":3},{"$f":"G722+FieldBeeForm!$E$11","v":15},2.9776602507872267,{"$f":"(VLOOKUP($F722,VegTypeParameters!A:G,6,FALSE))","v":3},{"$f":"(VLOOKUP($F722,VegTypeParameters!A:G,7,FALSE))","v":1.08},3.925206627733659,null,0,8.9188851385636738,8.8926342217348378,0,0,{"$f":"VLOOKUP($F722,VegTypeParameters!$A:$H,8,FALSE)","v":"Early/Mid/Late"},"Early/Mid/Late","Lupinus spp.","Lupinus spp.","Lupinus spp."]
[10,13,0,0,0.08,6000,3,{"$f":"VLOOKUP(F723,VegTypeParameters!A:G,2,FALSE)","v":"Orchard"},{"$f":"VLOOKUP($F723,VegTypeParameters!$A:$G,5,FALSE)","v":0.5},{"$f":"VLOOKUP($F723,VegTypeParameters!$A:$G,4,FALSE)","v":10},{"$f":"G723+FieldBeeForm!$E$11","v":15},5.2763344725898529,{"$f":"(VLOOKUP($F723,VegTypeParameters!A:G,6,FALSE))","v":6},{"$f":"(VLOOKUP($F723,VegTypeParameters!A:G,7,FALSE))","v":0.5},1.7614473685136525,null,0,18.326714576526665,22.58783601812447,0,0,{"$f":"VLOOKUP($F723,VegTypeParameters!$A:$H,8,FALSE)","v":"Early"},"Early","Orchard",".","."]
[10,14,0,0,0.03,3300,5,{"$f":"VLOOKUP(F724,VegTypeParameters!A:G,2,FALSE)","v":"Eschscholzia"},{"$f":"VLOOKUP($F724,VegTypeParameters!$A:$G,5,FALSE)","v":0.6},{"$f":"VLOOKUP($F724,VegTypeParameters!$A:$G,4,FALSE)","v":0.3},{"$f":"G724+FieldBeeForm!$E$11","v":17},0.29999999999999949,{"$f":"(VLOOKUP($F724,VegTypeParameters!A:G,6,FALSE))","v":0.15},{"$f":"(VLOOKUP($F724,VegTypeParameters!A:G,7,FALSE))","v":0.3},2.2497957049536645E-2,null,0,2.2499999999999923E-2,4.4999999999999846E-2,0,0,{"$f":"VLOOKUP($F724,VegTypeParameters!$A:$H,8,FALSE)","v":"Early/Mid"},"Early/Mid","Eschscholzia","Eschscholzia","."]
[10,15,0,0,0.03,5600,3,{"$f":"VLOOKUP(F725,VegTypeParameters!A:G,2,FALSE)","v":"Native forbs and graminoids not beneficial to pollinators"},{"$f":"VLOOKUP($F725,VegTypeParameters!$A:$G,5,FALSE)","v":0},{"$f":"VLOOKUP($F725,VegTypeParameters!$A:$G,4,FALSE)","v":0},{"$f":"G725+FieldBeeForm!$E$11","v":15},{"$f":"IF(J725>0,J725*(1-EXP(-I725*K725/J725)), 0)","v":0},{"$f":"(VLOOKUP($F725,VegTypeParameters!A:G,6,FALSE))","v":0},{"$f":"(VLOOKUP($F725,VegTypeParameters!A:G,7,FALSE))","v":0},{"$f":"IF(M725>0, (M725*(1-EXP(-N725*G725/M725)))*(M725*(1-EXP(-N725*G725/M725))),0)","v":0},null,{"$f":"IF(O725>0, (D725*E725)/O725,0)","v":0},{"$f":"IF(M725>0, (M725*(1-EXP(-N725*K725/M725)))*(M725*(1-EXP(-N725*K725/M725))), 0)","v":0},{"$f":"IF(M725>0,(M725*(1-EXP(-N725*K725/M725)))*L725,0)","v":0},0,0,{"$f":"VLOOKUP($F725,VegTypeParameters!$A:$H,8,FALSE)","v":"Never"},"Never",".",".","."]
[10,16,0,0,0.08,3800,3,{"$f":"VLOOKUP(F726,VegTypeParameters!A:G,2,FALSE)","v":"Gilia"},{"$f":"VLOOKUP($F726,VegTypeParameters!$A:$G,5,FALSE)","v":0.6},{"$f":"VLOOKUP($F726,VegTypeParameters!$A:$G,4,FALSE)","v":0.3},{"$f":"G726+FieldBeeForm!$E$11","v":15},{"$f":"IF(J726>0,J726*(1-EXP(-I726*K726/J726)), 0)","v":0.2999999999999719},{"$f":"(VLOOKUP($F726,VegTypeParameters!A:G,6,FALSE))","v":0.15},{"$f":"(VLOOKUP($F726,VegTypeParameters!A:G,7,FALSE))","v":0.3},{"$f":"IF(M726>0, (M726*(1-EXP(-N726*G726/M726)))*(M726*(1-EXP(-N726*G726/M726))),0)","v":2.2388594396827964E-2},null,{"$f":"IF(O726>0, (D726*E726)/O726,0)","v":0},{"$f":"IF(M726>0, (M726*(1-EXP(-N726*K726/M726)))*(M726*(1-EXP(-N726*K726/M726))), 0)","v":2.2499999999995784E-2},{"$f":"IF(M726>0,(M726*(1-EXP(-N726*K726/M726)))*L726,0)","v":4.4999999999991568E-2},0,0,{"$f":"VLOOKUP($F726,VegTypeParameters!$A:$H,8,FALSE)","v":"Mid"},"Mid",".","Gilia","."]
[10,17,0,0,0.08,1500,3,{"$f":"VLOOKUP(F727,VegTypeParameters!A:G,2,FALSE)","v":"Asclepias"},{"$f":"VLOOKUP($F727,VegTypeParameters!$A:$G,5,FALSE)","v":0.8},{"$f":"VLOOKUP($F727,VegTypeParameters!$A:$G,4,FALSE)","v":0.8},{"$f":"G727+FieldBeeForm!$E$11","v":15},0.79999975527814371,{"$f":"(VLOOKUP($F727,VegTypeParameters!A:G,6,FALSE))","v":0.2},{"$f":"(VLOOKUP($F727,VegTypeParameters!A:G,7,FALSE))","v":0.2},3.6116184617637548E-2,null,0,3.9999975527818116E-2,0.15999990211127246,0,0,{"$f":"VLOOKUP($F727,VegTypeParameters!$A:$H,8,FALSE)","v":"Early/Mid/Late"},"Early/Mid/Late","Asclepias","Asclepias","Asclepias"]
[10,18,0,0,5.0000000000000001E-3,1600,1,{"$f":"VLOOKUP(F728,VegTypeParameters!A:G,2,FALSE)","v":"Atriplex"},{"$f":"VLOOKUP($F728,VegTypeParameters!$A:$G,5,FALSE)","v":3.2962962962962963},{"$f":"VLOOKUP($F728,VegTypeParameters!$A:$G,4,FALSE)","v":3},{"$f":"G728+FieldBeeForm!$E$11","v":13},2.9999981220660135,{"$f":"(VLOOKUP($F728,VegTypeParameters!A:G,6,FALSE))","v":5},{"$f":"(VLOOKUP($F728,VegTypeParameters!A:G,7,FALSE))","v":7.1111111111111107},14.395290762184326,null,0,24.999999532966985,14.999990470220251,0,0,{"$f":"VLOOKUP($F728,VegTypeParameters!$A:$H,8,FALSE)","v":"Mid/Late"},"Mid/Late",".","Atriplex","Atriplex"]
[10,19,0,0,null,null,null,{"$f":"VLOOKUP(F729,VegTypeParameters!A:G,2,FALSE)","v":{"$error":"#N/A"}},{"$f":"VLOOKUP($F729,VegTypeParameters!$A:$G,5,FALSE)","v":{"$error":"#N/A"}},{"$f":"VLOOKUP($F729,VegTypeParameters!$A:$G,4,FALSE)","v":{"$error":"#N/A"}},{"$f":"G729+FieldBeeForm!$E$11","v":12},{"$error":"#N/A"},{"$f":"(VLOOKUP($F729,VegTypeParameters!A:G,6,FALSE))","v":{"$error":"#N/A"}},{"$f":"(VLOOKUP($F729,VegTypeParameters!A:G,7,FALSE))","v":{"$error":"#N/A"}},{"$error":"#N/A"},null,{"$error":"#N/A"},{"$error":"#N/A"},{"$error":"#N/A"},{"$error":"#N/A"},{"$error":"#N/A"},{"$f":"VLOOKUP($F729,VegTypeParameters!$A:$H,8,FALSE)","v":{"$error":"#N/A"}},".",".",".","."]
[10,20,0,0,null,null,null,{"$f":"VLOOKUP(F730,VegTypeParameters!A:G,2,FALSE)","v":{"$error":"#N/A"}},{"$f":"VLOOKUP($F730,VegTypeParameters!$A:$G,5,FALSE)","v":{"$error":"#N/A"}},{"$f":"VLOOKUP($F730,VegTypeParameters!$A:$G,4,FALSE)","v":{"$error":"#N/A"}},{"$f":"G730+FieldBeeForm!$E$11","v":12},{"$error":"#N/A"},{"$f":"(VLOOKUP($F730,VegTypeParameters!A:G,6,FALSE))","v":{"$error":"#N/A"}},{"$f":"(VLOOKUP($F730,VegTypeParameters!A:G,7,FALSE))","v":{"$error":"#N/A"}},{"$error":"#N/A"},null,{"$error":"#N/A"},{"$error":"#N/A"},{"$error":"#N/A"},{"$error":"#N/A"},{"$error":"#N/A"},{"$f":"VLOOKUP($F730,VegTypeParameters!$A:$H,8,FALSE)","v":{"$error":"#N/A"}},".",".",".","."]
[10,21,0,0,null,null,null,{"$f":"VLOOKUP(F731,VegTypeParameters!A:G,2,FALSE)","v":{"$error":"#N/A"}},{"$f":"VLOOKUP($F731,VegTypeParameters!$A:$G,5,FALSE)","v":{"$error":"#N/A"}},{"$f":"VLOOKUP($F731,VegTypeParameters!$A:$G,4,FALSE)","v":{"$error":"#N/A"}},{"$f":"G731+FieldBeeForm!$E$11","v":12},{"$error":"#N/A"},{"$f":"(VLOOKUP($F731,VegTypeParameters!A:G,6,FALSE))","v":{"$error":"#N/A"}},{"$f":"(VLOOKUP($F731,VegTypeParameters!A:G,7,FALSE))","v":{"$error":"#N/A"}},{"$error":"#N/A"},null,{"$error":"#N/A"},{"$error":"#N/A"},{"$error":"#N/A"},{"$error":"#N/A"},{"$error":"#N/A"},{"$f":"VLOOKUP($F731,VegTypeParameters!$A:$H,8,FALSE)","v":{"$error":"#N/A"}},".",".",".","."]
[10,22,0,0,null,null,null,{"$f":"VLOOKUP(F732,VegTypeParameters!A:G,2,FALSE)","v":{"$error":"#N/A"}},{"$f":"VLOOKUP($F732,VegTypeParameters!$A:$G,5,FALSE)","v":{"$error":"#N/A"}},{"$f":"VLOOKUP($F732,VegTypeParameters!$A:$G,4,FALSE)","v":{"$error":"#N/A"}},{"$f":"G732+FieldBeeForm!$E$11","v":12},{"$error":"#N/A"},{"$f":"(VLOOKUP($F732,VegTypeParameters!A:G,6,FALSE))","v":{"$error":"#N/A"}},{"$f":"(VLOOKUP($F732,VegTypeParameters!A:G,7,FALSE))","v":{"$error":"#N/A"}},{"$error":"#N/A"},null,{"$error":"#N/A"},{"$error":"#N/A"},{"$error":"#N/A"},{"$error":"#N/A"},{"$error":"#N/A"},{"$f":"VLOOKUP($F732,VegTypeParameters!$A:$H,8,FALSE)","v":{"$error":"#N/A"}},".",".",".","."]
[10,23,0,0,null,null,null,{"$f":"VLOOKUP(F733,VegTypeParameters!A:G,2,FALSE)","v":{"$error":"#N/A"}},{"$f":"VLOOKUP($F733,VegTypeParameters!$A:$G,5,FALSE)","v":{"$error":"#N/A"}},{"$f":"VLOOKUP($F733,VegTypeParameters!$A:$G,4,FALSE)","v":{"$error":"#N/A"}},{"$f":"G733+FieldBeeForm!$E$11","v":12},{"$error":"#N/A"},{"$f":"(VLOOKUP($F733,VegTypeParameters!A:G,6,FALSE))","v":{"$error":"#N/A"}},{"$f":"(VLOOKUP($F733,VegTypeParameters!A:G,7,FALSE))","v":{"$error":"#N/A"}},{"$error":"#N/A"},null,{"$error":"#N/A"},{"$error":"#N/A"},{"$error":"#N/A"},{"$error":"#N/A"},{"$error":"#N/A"},{"$f":"VLOOKUP($F733,VegTypeParameters!$A:$H,8,FALSE)","v":{"$error":"#N/A"}},".",".",".","."]
[10,24,0,0,null,null,null,{"$f":"VLOOKUP(F734,VegTypeParameters!A:G,2,FALSE)","v":{"$error":"#N/A"}},{"$f":"VLOOKUP($F734,VegTypeParameters!$A:$G,5,FALSE)","v":{"$error":"#N/A"}},{"$f":"VLOOKUP($F734,VegTypeParameters!$A:$G,4,FALSE)","v":{"$error":"#N/A"}},{"$f":"G734+FieldBeeForm!$E$11","v":12},{"$error":"#N/A"},{"$f":"(VLOOKUP($F734,VegTypeParameters!A:G,6,FALSE))","v":{"$error":"#N/A"}},{"$f":"(VLOOKUP($F734,VegTypeParameters!A:G,7,FALSE))","v":{"$error":"#N/A"}},{"$error":"#N/A"},null,{"$error":"#N/A"},{"$error":"#N/A"},{"$error":"#N/A"},{"$error":"#N/A"},{"$error":"#N/A"},{"$f":"VLOOKUP($F734,VegTypeParameters!$A:$H,8,FALSE)","v":{"$error":"#N/A"}},".",".",".","."]
[10,25,0,0,null,null,null,{"$f":"VLOOKUP(F735,VegTypeParameters!A:G,2,FALSE)","v":{"$error":"#N/A"}},{"$f":"VLOOKUP($F735,VegTypeParameters!$A:$G,5,FALSE)","v":{"$error":"#N/A"}},{"$f":"VLOOKUP($F735,VegTypeParameters!$A:$G,4,FALSE)","v":{"$error":"#N/A"}},{"$f":"G735+FieldBeeForm!$E$11","v":12},{"$f":"IF(J735>0,J735*(1-EXP(-I735*K735/J735)), 0)","v":{"$error":"#N/A"}},{"$f":"(VLOOKUP($F735,VegTypeParameters!A:G,6,FALSE))","v":{"$error":"#N/A"}},{"$f":"(VLOOKUP($F735,VegTypeParameters!A:G,7,FALSE))","v":{"$error":"#N/A"}},{"$f":"IF(M735>0, (M735*(1-EXP(-N735*G735/M735)))*(M735*(1-EXP(-N735*G735/M735))),0)","v":{"$error":"#N/A"}},null,{"$f":"IF(O735>0, (D735*E735)/O735,0)","v":{"$error":"#N/A"}},{"$f":"IF(M735>0, (M735*(1-EXP(-N735*K735/M735)))*(M735*(1-EXP(-N735*K735/M735))), 0)","v":{"$error":"#N/A"}},{"$f":"IF(M735>0,(M735*(1-EXP(-N735*K735/M735)))*L735,0)","v":{"$error":"#N/A"}},{"$error":"#N/A"},{"$error":"#N/A"},{"$f":"VLOOKUP($F735,VegTypeParameters!$A:$H,8,FALSE)","v":{"$error":"#N/A"}},".",".",".","."]
[10,26,0,0,null,null,null,{"$f":"VLOOKUP(F736,VegTypeParameters!A:G,2,FALSE)","v":{"$error":"#N/A"}},{"$f":"VLOOKUP($F736,VegTypeParameters!$A:$G,5,FALSE)","v":{"$error":"#N/A"}},{"$f":"VLOOKUP($F736,VegTypeParameters!$A:$G,4,FALSE)","v":{"$error":"#N/A"}},{"$f":"G736+FieldBeeForm!$E$11","v":12},{"$f":"IF(J736>0,J736*(1-EXP(-I736*K736/J736)), 0)","v":{"$error":"#N/A"}},{"$f":"(VLOOKUP($F736,VegTypeParameters!A:G,6,FALSE))","v":{"$error":"#N/A"}},{"$f":"(VLOOKUP($F736,VegTypeParameters!A:G,7,FALSE))","v":{"$error":"#N/A"}},{"$f":"IF(M736>0, (M736*(1-EXP(-N736*G736/M736)))*(M736*(1-EXP(-N736*G736/M736))),0)","v":{"$error":"#N/A"}},null,{"$f":"IF(O736>0, (D736*E736)/O736,0)","v":{"$error":"#N/A"}},{"$f":"IF(M736>0, (M736*(1-EXP(-N736*K736/M736)))*(M736*(1-EXP(-N736*K736/M736))), 0)","v":{"$error":"#N/A"}},{"$f":"IF(M736>0,(M736*(1-EXP(-N736*K736/M736)))*L736,0)","v":{"$error":"#N/A"}},{"$error":"#N/A"},{"$error":"#N/A"},{"$f":"VLOOKUP($F736,VegTypeParameters!$A:$H,8,FALSE)","v":{"$error":"#N/A"}},".",".",".","."]
[10,27,0,0,null,null,null,{"$f":"VLOOKUP(F737,VegTypeParameters!A:G,2,FALSE)","v":{"$error":"#N/A"}},{"$f":"VLOOKUP($F737,VegTypeParameters!$A:$G,5,FALSE)","v":{"$error":"#N/A"}},{"$f":"VLOOKUP($F737,VegTypeParameters!$A:$G,4,FALSE)","v":{"$error":"#N/A"}},{"$f":"G737+FieldBeeForm!$E$11","v":12},{"$error":"#N/A"},{"$f":"(VLOOKUP($F737,VegTypeParameters!A:G,6,FALSE))","v":{"$error":"#N/A"}},{"$f":"(VLOOKUP($F737,VegTypeParameters!A:G,7,FALSE))","v":{"$error":"#N/A"}},{"$error":"#N/A"},null,{"$error":"#N/A"},{"$error":"#N/A"},{"$error":"#N/A"},{"$error":"#N/A"},{"$error":"#N/A"},{"$f":"VLOOKUP($F737,VegTypeParameters!$A:$H,8,FALSE)","v":{"$error":"#N/A"}},".",".",".","."]
[10,28,0,0,null,null,null,{"$f":"VLOOKUP(F738,VegTypeParameters!A:G,2,FALSE)","v":{"$error":"#N/A"}},{"$f":"VLOOKUP($F738,VegTypeParameters!$A:$G,5,FALSE)","v":{"$error":"#N/A"}},{"$f":"VLOOKUP($F738,VegTypeParameters!$A:$G,4,FALSE)","v":{"$error":"#N/A"}},{"$f":"G738+FieldBeeForm!$E$11","v":12},{"$error":"#N/A"},{"$f":"(VLOOKUP($F738,VegTypeParameters!A:G,6,FALSE))","v":{"$error":"#N/A"}},{"$f":"(VLOOKUP($F738,VegTypeParameters!A:G,7,FALSE))","v":{"$error":"#N/A"}},{"$error":"#N/A"},null,{"$error":"#N/A"},{"$error":"#N/A"},{"$error":"#N/A"},{"$error":"#N/A"},{"$error":"#N/A"},{"$f":"VLOOKUP($F738,VegTypeParameters!$A:$H,8,FALSE)","v":{"$error":"#N/A"}},".",".",".","."]
[10,29,0,0,null,null,null,{"$f":"VLOOKUP(F739,VegTypeParameters!A:G,2,FALSE)","v":{"$error":"#N/A"}},{"$f":"VLOOKUP($F739,VegTypeParameters!$A:$G,5,FALSE)","v":{"$error":"#N/A"}},{"$f":"VLOOKUP($F739,VegTypeParameters!$A:$G,4,FALSE)","v":{"$error":"#N/A"}},{"$f":"G739+FieldBeeForm!$E$11","v":12},{"$error":"#N/A"},{"$f":"(VLOOKUP($F739,VegTypeParameters!A:G,6,FALSE))","v":{"$error":"#N/A"}},{"$f":"(VLOOKUP($F739,VegTypeParameters!A:G,7,FALSE))","v":{"$error":"#N/A"}},{"$error":"#N/A"},null,{"$error":"#N/A"},{"$error":"#N/A"},{"$error":"#N/A"},{"$error":"#N/A"},{"$error":"#N/A"},{"$f":"VLOOKUP($F739,VegTypeParameters!$A:$H,8,FALSE)","v":{"$error":"#N/A"}},".",".",".","."]
[10,30,0,0,null,null,null,{"$f":"VLOOKUP(F740,VegTypeParameters!A:G,2,FALSE)","v":{"$error":"#N/A"}},{"$f":"VLOOKUP($F740,VegTypeParameters!$A:$G,5,FALSE)","v":{"$error":"#N/A"}},{"$f":"VLOOKUP($F740,VegTypeParameters!$A:$G,4,FALSE)","v":{"$error":"#N/A"}},{"$f":"G740+FieldBeeForm!$E$11","v":12},{"$error":"#N/A"},{"$f":"(VLOOKUP($F740,VegTypeParameters!A:G,6,FALSE))","v":{"$error":"#N/A"}},{"$f":"(VLOOKUP($F740,VegTypeParameters!A:G,7,FALSE))","v":{"$error":"#N/A"}},{"$error":"#N/A"},null,{"$error":"#N/A"},{"$error":"#N/A"},{"$error":"#N/A"},{"$error":"#N/A"},{"$error":"#N/A"},{"$f":"VLOOKUP($F740,VegTypeParameters!$A:$H,8,FALSE)","v":{"$error":"#N/A"}},".",".",".","."]
[10,31,0,0,null,null,null,{"$f":"VLOOKUP(F741,VegTypeParameters!A:G,2,FALSE)","v":{"$error":"#N/A"}},{"$f":"VLOOKUP($F741,VegTypeParameters!$A:$G,5,FALSE)","v":{"$error":"#N/A"}},{"$f":"VLOOKUP($F741,VegTypeParameters!$A:$G,4,FALSE)","v":{"$error":"#N/A"}},{"$f":"G741+FieldBeeForm!$E$11","v":12},{"$error":"#N/A"},{"$f":"(VLOOKUP($F741,VegTypeParameters!A:G,6,FALSE))","v":{"$error":"#N/A"}},{"$f":"(VLOOKUP($F741,VegTypeParameters!A:G,7,FALSE))","v":{"$error":"#N/A"}},{"$error":"#N/A"},null,{"$error":"#N/A"},{"$error":"#N/A"},{"$error":"#N/A"},{"$error":"#N/A"},{"$error":"#N/A"},{"$f":"VLOOKUP($F741,VegTypeParameters!$A:$H,8,FALSE)","v":{"$error":"#N/A"}},".",".",".","."]
[10,32,0,0,null,null,null,{"$f":"VLOOKUP(F742,VegTypeParameters!A:G,2,FALSE)","v":{"$error":"#N/A"}},{"$f":"VLOOKUP($F742,VegTypeParameters!$A:$G,5,FALSE)","v":{"$error":"#N/A"}},{"$f":"VLOOKUP($F742,VegTypeParameters!$A:$G,4,FALSE)","v":{"$error":"#N/A"}},{"$f":"G742+FieldBeeForm!$E$11","v":12},{"$error":"#N/A"},{"$f":"(VLOOKUP($F742,VegTypeParameters!A:G,6,FALSE))","v":{"$error":"#N/A"}},{"$f":"(VLOOKUP($F742,VegTypeParameters!A:G,7,FALSE))","v":{"$error":"#N/A"}},{"$error":"#N/A"},null,{"$error":"#N/A"},{"$error":"#N/A"},{"$error":"#N/A"},{"$error":"#N/A"},{"$error":"#N/A"},{"$f":"VLOOKUP($F742,VegTypeParameters!$A:$H,8,FALSE)","v":{"$error":"#N/A"}},".",".",".","."]
[10,33,0,0,null,null,null,{"$f":"VLOOKUP(F743,VegTypeParameters!A:G,2,FALSE)","v":{"$error":"#N/A"}},{"$f":"VLOOKUP($F743,VegTypeParameters!$A:$G,5,FALSE)","v":{"$error":"#N/A"}},{"$f":"VLOOKUP($F743,VegTypeParameters!$A:$G,4,FALSE)","v":{"$error":"#N/A"}},{"$f":"G743+FieldBeeForm!$E$11","v":12},{"$error":"#N/A"},{"$f":"(VLOOKUP($F743,VegTypeParameters!A:G,6,FALSE))","v":{"$error":"#N/A"}},{"$f":"(VLOOKUP($F743,VegTypeParameters!A:G,7,FALSE))","v":{"$error":"#N/A"}},{"$error":"#N/A"},null,{"$error":"#N/A"},{"$error":"#N/A"},{"$error":"#N/A"},{"$error":"#N/A"},{"$error":"#N/A"},{"$f":"VLOOKUP($F743,VegTypeParameters!$A:$H,8,FALSE)","v":{"$error":"#N/A"}},".",".",".","."]
[10,34,0,0,null,null,null,{"$f":"VLOOKUP(F744,VegTypeParameters!A:G,2,FALSE)","v":{"$error":"#N/A"}},{"$f":"VLOOKUP($F744,VegTypeParameters!$A:$G,5,FALSE)","v":{"$error":"#N/A"}},{"$f":"VLOOKUP($F744,VegTypeParameters!$A:$G,4,FALSE)","v":{"$error":"#N/A"}},{"$f":"G744+FieldBeeForm!$E$11","v":12},{"$error":"#N/A"},{"$f":"(VLOOKUP($F744,VegTypeParameters!A:G,6,FALSE))","v":{"$error":"#N/A"}},{"$f":"(VLOOKUP($F744,VegTypeParameters!A:G,7,FALSE))","v":{"$error":"#N/A"}},{"$error":"#N/A"},null,{"$error":"#N/A"},{"$error":"#N/A"},{"$error":"#N/A"},{"$error":"#N/A"},{"$error":"#N/A"},{"$f":"VLOOKUP($F744,VegTypeParameters!$A:$H,8,FALSE)","v":{"$error":"#N/A"}},".",".",".","."]
[10,35,0,0,null,null,null,{"$f":"VLOOKUP(F745,VegTypeParameters!A:G,2,FALSE)","v":{"$error":"#N/A"}},{"$f":"VLOOKUP($F745,VegTypeParameters!$A:$G,5,FALSE)","v":{"$error":"#N/A"}},{"$f":"VLOOKUP($F745,VegTypeParameters!$A:$G,4,FALSE)","v":{"$error":"#N/A"}},{"$f":"G745+FieldBeeForm!$E$11","v":12},{"$error":"#N/A"},{"$f":"(VLOOKUP($F745,VegTypeParameters!A:G,6,FALSE))","v":{"$error":"#N/A"}},{"$f":"(VLOOKUP($F745,VegTypeParameters!A:G,7,FALSE))","v":{"$error":"#N/A"}},{"$error":"#N/A"},null,{"$error":"#N/A"},{"$error":"#N/A"},{"$error":"#N/A"},{"$error":"#N/A"},{"$error":"#N/A"},{"$f":"VLOOKUP($F745,VegTypeParameters!$A:$H,8,FALSE)","v":{"$error":"#N/A"}},".",".",".","."]
[null,null,null,"Horizontal extent of pollinator plant cover (m2) per season",null,null,null,"Vertical extent of pollinator plant cover (m2) per season",null,null,null,"Number of different pollinator plant species per season"]
["Map Unit #","Vegetation Entry",null,"Spatial extent of Veg Type (m2)","Early","Mid","Late","Spatial extent of Veg Type (m2)","Early","Mid","Late","Early","Mid","Late"]
[{"$f":"A711","v":10},{"$f":"B711","v":1},null,{"$f":"+IF(ISNA(VLOOKUP(B748,B$711:D$745, 3, FALSE)),0,VLOOKUP(B748,B$711:D$745, 3, FALSE))","v":0},{"$f":"+IF(SUMIFS(T$711:T$745, B$711:B$745, $B748, V$711:V$745, \"*\"&\"Early\"&\"*\") <=$D748, SUMIFS(T$711:T$745, B$711:B$745, $B748, V$711:V$745, \"*\"&\"Early\"&\"*\"), $D748)","v":0},{"$f":"+IF(SUMIFS(T$711:T$745,B$711:B$745, $B748, V$711:V$745, \"*\"&\"Mid\"&\"*\") <=$D748, SUMIFS(T$711:T$745,B$711:B$745, $B748, V$711:V$745, \"*\"&\"Mid\"&\"*\"), $D748)","v":0},{"$f":"+IF(SUMIFS(T$711:T$745, B$711:B$745, $B748, $V$711:$V$745, \"*\"&\"Late\"&\"*\") <=$D748, SUMIFS(T$711:T$745,B$711:B$745, $B748,$V$711:$V$745, \"*\"&\"Late\"&\"*\"), $D748)","v":0},{"$f":"+IF(ISNA(VLOOKUP(B748,B$711:D$745, 3, FALSE)),0,VLOOKUP(B748,B$711:D$745, 3, FALSE))","v":0},{"$f":"+IF(SUMIFS($U$711:$U$745, $B$711:$B$745, $B748, $V$711:$V$745, \"*\"&\"Early\"&\"*\") <=$D748, SUMIFS($U$711:$U$745, $B$711:$B$745, $B748, $V$711:$V$745, \"*\"&\"Early\"&\"*\"), $D748)","v":0},{"$f":"+IF(SUMIFS($U$711:$U$745, $B$711:$B$745, $B748, $V$711:$V$745, \"*\"&\"Mid\"&\"*\") <=$D748, SUMIFS($U$711:$U$745, $B$711:$B$745, $B748, $V$711:$V$745, \"*\"&\"Mid\"&\"*\"), $D748)","v":0},{"$f":"+IF(SUMIFS($U$711:$U$745, $B$711:$B$745, $B748, $V$711:$V$745, \"*\"&\"Late\"&\"*\") <=$D748, SUMIFS($U$711:$U$745, $B$711:$B$745, $B748, $V$711:$V$745, \"*\"&\"Late\"&\"*\"), $D748)","v":0}," "]
[{"$f":"A712","v":10},2,null,{"$f":"+IF(ISNA(VLOOKUP(B749,B$711:D$745, 3, FALSE)),0,VLOOKUP(B749,B$711:D$745, 3, FALSE))","v":0},{"$f":"+IF(SUMIFS(T$711:T$745, B$711:B$745, $B749, V$711:V$745, \"*\"&\"Early\"&\"*\") <=$D749, SUMIFS(T$711:T$745, B$711:B$745, $B749, V$711:V$745, \"*\"&\"Early\"&\"*\"), $D749)","v":0},{"$f":"+IF(SUMIFS(T$711:T$745,B$711:B$745, $B749, V$711:V$745, \"*\"&\"Mid\"&\"*\") <=$D749, SUMIFS(T$711:T$745,B$711:B$745, $B749, V$711:V$745, \"*\"&\"Mid\"&\"*\"), $D749)","v":0},{"$f":"+IF(SUMIFS(T$711:T$745, B$711:B$745, $B749, $V$711:$V$745, \"*\"&\"Late\"&\"*\") <=$D749, SUMIFS(T$711:T$745,B$711:B$745, $B749,$V$711:$V$745, \"*\"&\"Late\"&\"*\"), $D749)","v":0},{"$f":"+IF(ISNA(VLOOKUP(B749,B$711:D$745, 3, FALSE)),0,VLOOKUP(B749,B$711:D$745, 3, FALSE))","v":0},{"$f":"+IF(SUMIFS($U$711:$U$745, $B$711:$B$745, $B749, $V$711:$V$745, \"*\"&\"Early\"&\"*\") <=$D749, SUMIFS($U$711:$U$745, $B$711:$B$745, $B749, $V$711:$V$745, \"*\"&\"Early\"&\"*\"), $D749)","v":0},{"$f":"+IF(SUMIFS($U$711:$U$745, $B$711:$B$745, $B749, $V$711:$V$745, \"*\"&\"Mid\"&\"*\") <=$D749, SUMIFS($U$711:$U$745, $B$711:$B$745, $B749, $V$711:$V$745, \"*\"&\"Mid\"&\"*\"), $D749)","v":0},{"$f":"+IF(SUMIFS($U$711:$U$745, $B$711:$B$745, $B749, $V$711:$V$745, \"*\"&\"Late\"&\"*\") <=$D749, SUMIFS($U$711:$U$745, $B$711:$B$745, $B749, $V$711:$V$745, \"*\"&\"Late\"&\"*\"), $D749)","v":0}," "]
[{"$f":"A713","v":10},3,null,0,0,0,0,0,0,0,0]
[{"$f":"A714","v":10},4,null,0,0,0,0,0,0,0,0]
[{"$f":"A715","v":10},5,null,0,0,0,0,0,0,0,0]
[{"$f":"A716","v":10},6,null,0,0,0,0,0,0,0,0]
[{"$f":"A717","v":10},7,null,0,0,0,0,0,0,0,0]
[{"$f":"A718","v":10},8,null,0,0,0,0,0,0,0,0]
[{"$f":"A719","v":10},9,null,0,0,0,0,0,0,0,0]
[{"$f":"A720","v":10},10,null,0,0,0,0,0,0,0,0]
[{"$f":"A721","v":10},11,null,{"$f":"+IF(ISNA(VLOOKUP(B758,B$711:D$745, 3, FALSE)),0,VLOOKUP(B758,B$711:D$745, 3, FALSE))","v":0},{"$f":"+IF(SUMIFS(T$711:T$745, B$711:B$745, $B758, V$711:V$745, \"*\"&\"Early\"&\"*\") <=$D758, SUMIFS(T$711:T$745, B$711:B$745, $B758, V$711:V$745, \"*\"&\"Early\"&\"*\"), $D758)","v":0},{"$f":"+IF(SUMIFS(T$711:T$745,B$711:B$745, $B758, V$711:V$745, \"*\"&\"Mid\"&\"*\") <=$D758, SUMIFS(T$711:T$745,B$711:B$745, $B758, V$711:V$745, \"*\"&\"Mid\"&\"*\"), $D758)","v":0},{"$f":"+IF(SUMIFS(T$711:T$745, B$711:B$745, $B758, $V$711:$V$745, \"*\"&\"Late\"&\"*\") <=$D758, SUMIFS(T$711:T$745,B$711:B$745, $B758,$V$711:$V$745, \"*\"&\"Late\"&\"*\"), $D758)","v":0},{"$f":"+IF(ISNA(VLOOKUP(B758,B$711:D$745, 3, FALSE)),0,VLOOKUP(B758,B$711:D$745, 3, FALSE))","v":0},0,0,0]
[{"$f":"A722","v":10},12,null,0,0,0,0,0,0,0,0]
[{"$f":"A723","v":10},13,null,0,0,0,0,0,0,0,0]
[{"$f":"A724","v":10},14,null,0,0,0,0,0,0,0,0]
[{"$f":"A725","v":10},15,null,0,0,0,0,0,0,0,0]
[{"$f":"A726","v":10},16,null,0,0,0,0,0,0,0,0]
[{"$f":"A727","v":10},17,null,0,0,0,0,0,0,0,0]
[{"$f":"A728","v":10},18,null,0,0,0,0,0,0,0,0]
[{"$f":"A729","v":10},19,null,0,0,0,0,0,0,0,0]
[{"$f":"A730","v":10},20,null,0,0,0,0,0,0,0,0]
[{"$f":"A731","v":10},21,null,0,0,0,0,0,0,0,0]
[{"$f":"A732","v":10},22,null,0,0,0,0,0,0,0,0]
[{"$f":"A733","v":10},23,null,0,0,0,0,0,0,0,0]
[{"$f":"A734","v":10},24,null,0,0,0,0,0,0,0,0]
[{"$f":"A735","v":10},25,null,0,0,0,0,0,0,0,0]
[{"$f":"A736","v":10},26,null,0,0,0,0,0,0,0,0]
[{"$f":"A737","v":10},27,null,0,0,0,0,0,0,0,0]
[{"$f":"A738","v":10},28,null,0,0,0,0,0,0,0,0]
[{"$f":"A739","v":10},29,null,0,0,0,0,0,0,0,0]
[{"$f":"A740","v":10},30,null,0,0,0,0,0,0,0,0]
[{"$f":"A741","v":10},31,null,0,0,0,0,0,0,0,0]
[{"$f":"A742","v":10},32,null,0,0,0,0,0,0,0,0]
[{"$f":"A743","v":10},33,null,0,0,0,0,0,0,0,0]
[{"$f":"A744","v":10},34,null,0,0,0,0,0,0,0,0]
[{"$f":"A745","v":10},35,null,0,0,0,0,0,0,0,0]
[{"$f":"A711","v":10},"Total",null,{"$f":"+SUM(D748:D782)","v":0},{"$f":"+SUM(E748:E782)","v":0},0,0,0,0,0,0,{"$f":"+X710","v":7},{"$f":"+Y710","v":10},{"$f":"+Z710","v":7}]
[null," ",null,{"$f":"D783","v":0},"Map Unit Size in Acres",null,{"$f":"FieldBeeForm!N14","v":20000},"Value entered in FieldBeeForm (Should be same as cell C534)"]

{"sheet":"Bee_Scoring","index":4,"n_rows":540,"n_cols":13,"rows_kept":540,"cut":false,"hidden":false,"merged":[[539,4,539,7],[530,0,535,0],[530,10,531,10],[530,11,531,11],[532,11,534,11],[538,4,538,7],[511,11,513,11],[514,10,516,10],[514,11,516,11],[519,0,523,0],[524,0,529,0],[485,4,485,7],[486,4,486,7],[508,0,509,0],[511,0,516,0],[511,10,513,10],[466,0,470,0],[471,0,476,0],[477,0,482,0],[477,10,478,10],[477,11,478,11],[479,11,481,11],[433,4,433,7],[455,0,456,0],[458,0,463,0],[458,10,460,10],[458,11,460,11],[461,10,463,10],[461,11,463,11],[424,0,429,0],[424,10,425,10],[424,11,425,11],[426,11,428,11],[432,4,432,7],[405,11,407,11],[408,10,410,10],[408,11,410,11],[413,0,417,0],[418,0,423,0],[379,4,379,7],[380,4,380,7],[402,0,403,0],[405,0,410,0],[405,10,407,10],[360,0,364,0],[365,0,370,0],[371,0,376,0],[371,10,372,10],[371,11,372,11],[373,11,375,11],[327,4,327,7],[349,0,350,0],[352,0,357,0],[352,10,354,10],[352,11,354,11],[355,10,357,10],[355,11,357,11],[318,0,323,0],[318,10,319,10],[318,11,319,11],[320,11,322,11],[326,4,326,7],[299,11,301,11],[302,10,304,10],[302,11,304,11],[307,0,311,0],[312,0,317,0],[273,4,273,7],[274,4,274,7],[296,0,297,0],[299,0,304,0],[299,10,301,10],[254,0,258,0],[259,0,264,0],[265,0,270,0],[265,10,266,10],[265,11,266,11],[267,11,269,11],[221,4,221,7],[243,0,244,0],[246,0,251,0],[246,10,248,10],[246,11,248,11],[249,10,251,10],[249,11,251,11],[212,0,217,0],[212,10,213,10],[212,11,213,11],[214,11,216,11],[220,4,220,7],[193,11,195,11],[196,10,198,10],[196,11,198,11],[201,0,205,0],[206,0,211,0],[167,4,167,7],[168,4,168,7],[190,0,191,0],[193,0,198,0],[193,10,195,10],[148,0,152,0],[153,0,158,0],[159,0,164,0],[159,10,160,10],[159,11,160,11],[161,11,163,11],[137,0,138,0],[140,0,145,0],[140,10,142,10],[140,11,142,11],[143,10,145,10],[143,11,145,11],[114,4,114,7],[115,4,115,7],[95,0,99,0],[100,0,105,0],[106,0,111,0],[106,10,107,10],[106,11,107,11],[108,11,110,11],[84,0,85,0],[87,0,92,0],[87,10,89,10],[87,11,89,11],[90,10,92,10],[90,11,92,11],[55,11,57,11],[23,11,25,11],[34,10,36,10],[34,11,36,11],[37,10,39,10],[37,11,39,11],[53,10,54,10],[53,11,54,11],[23,10,25,10],[12,11,13,11],[16,11,17,11],[18,11,19,11],[20,11,21,11],[14,10,15,10],[14,11,15,11],[18,10,19,10],[16,10,17,10],[20,10,21,10],[62,4,62,7],[61,4,61,7],[53,0,58,0],[47,0,52,0],[42,0,46,0],[0,1,1,10],[2,0,3,4],[6,0,7,0],[5,2,5,10],[10,2,10,10],[31,0,32,0],[34,0,39,0],[3,5,3,8],[2,5,2,8],[29,2,29,8],[23,0,26,0],[12,0,22,0],[12,10,13,10]]}
[null,"Do not enter data into this model worksheet, it automatically pulls data from the office and field forms.  Data from these forms are pulled into column D 'Data'.  Column E 'Maximum Value' provides the highest possible score for each variable.  Column F 'Normalize' divides the data score by the maximum value so that all scores range from 0 to 1.0.  Column G 'Weight' provides a weight for the particular variable in relation to the other variables, based on the ecological importance of that variable.  Column H 'Score' multiplies the normalized value by the weight. The score for each group of variables and for each Map Unit is based upon the weighted average of each indicator score, calculated as the sum of the  weighted and normalized values [column H] over the sum of weights [total maximum weighted normalized values]. Column I 'Final Score' returns the unweighted score for that particular variable by dividing the weighted score by the weight (same value provided in column F)"]
[]
["Pollinator Scoring",null,null,null,null,"Pollinator Project Area (acres):",null,null,null,null,{"$f":"FieldBeeForm!E8","v":3.2}]
[null,null,null,null,null,"Number of Pollinator Map Units:",null,null,null,null,{"$f":"FieldBeeForm!E9","v":20}]
[null,"Variable Number","Indicator","Data","Maximum Value","Normalize","Weight","Score (Normalize x Weight)","Final Score","Habitat Acres","Explanation and Rationale","Citation"]
[null,null,"Opportunity and Value Scoring for Project Area"]
["Landscape support for pollinator populations",{"$f":"OfficeForm!B8","v":1},"Percent of surrounding landscape that is 'wild'.",{"$f":"IF(OfficeForm!D29>0.3, 4, IF(OfficeForm!D29>0.15, 3, IF(OfficeForm!D29>0.05, 2, 1)))","v":4},4,{"$f":"+D7/E7","v":1},3,{"$f":"+F7*G7","v":3},{"$f":"H7/G7","v":1},null,"If there is very little wild habitat surrounding the project site, then there is a greater opportunity to improve pollinator services in the area and thus a higher score for opportunity.  However, if there is no wild habitat at all, then the Project Area will not have a source bee population - thus, sites with no surrounding wild habitat do not get the maximum score but rather a score of 75%.  Opportunity was weighted equal to value.","Klein et al. 2007; Kremen et al. 2004, Williams and Kremen 2007,  Winfree et al. 2008, extrapolated from NRCS 2009 0.5-mi scale"," "]
[null,{"$f":"OfficeForm!B30","v":2},"Ratio of pollinator habitat area to area of pollinator dependent crops in 0.5 mi buffer area (1.5:25 is optimal, below that is an opportunity to increase pollinator habitat)",{"$f":"+IF(FieldBeeForm!G8>40, 4, IF(FieldBeeForm!G8>30, 3, IF(FieldBeeForm!G8>20, 2, 1)))","v":3},4,{"$f":"+D8/E8","v":0.75},1,{"$f":"+F8*G8","v":0.75},{"$f":"H8/G8","v":0.75},null,"If there are pollinator dependent crops in the surrounding landscape, then providing pollinator habitat benefits these crops.  NRCS 2009 suggests 1 to 2 acres of pollinator habitat for every 25 acres of every cropped (pollinator dependent crop) acre. Thus, if ratio is much higher (e.g. 5 acres habitat per 25 acres crops), then the opportunity and need is not high. Value was weighted equal to opportunity. Bin scores assigned by ratios of pollinator crop dependent acres to proposed pollinator habitat acres: >40:1 = 4; 30 to 39:1 =3; 20-29:1=2; <20:1=1.","Chaplin-Kramer et al. 2011, Greenleaf and Kremen 2006, Morandin and Winston 2006, Klein et al. 2007; Winfree et al. 2008, extrapolated from NRCS 2009 0.5-mi scale"," "]
[null,3,"Percent of total farm that is included in the pollinator Project Area",{"$f":"IF(FieldBeeForm!F12>0.099,6,IF(FieldBeeForm!F12>0.051,5,IF(FieldBeeForm!F12>0.04,4,IF(FieldBeeForm!F12>0.01,3,IF(FieldBeeForm!F12>0.001,2,IF(FieldBeeForm!F12>0.0001,1,0))))))","v":3},6,{"$f":"+D9/E9","v":0.5},1,{"$f":"+F9*G9","v":0.5},{"$f":"H9/G9","v":0.5},null,"Having many different pollinator habitat areas across the landscape supports pollinators over a broader matrix of lands, and is especially valuable where there are many small farms. Ten percent of the farm acreage was set as the most one can hope for from an active farm.","Winfree et al. 2007"]
[null,null,"Project Area Opportunity and Value SCORE",null,null,null,{"$f":"+SUM(G7:G9)","v":5},{"$f":"SUM(H7:H9)","v":4.25},{"$f":"+H10/G10","v":0.85},{"$f":"I10*FieldBeeForm!E8","v":2.72}]
[null,null,"Site Capacity Scoring for Project Area"]
[null,"A","Overall project area (in acres):",{"$f":"IF(FieldBeeForm!F12=0.1,6,IF(FieldBeeForm!E8>10,6,IF(FieldBeeForm!F12>0.051,5,IF(FieldBeeForm!E8>4.1,5,IF(FieldBeeForm!F12>0.04,4,IF(FieldBeeForm!E8>2.1,4,IF(FieldBeeForm!F12>0.01,3,IF(FieldBeeForm!E8>0.5,3,IF(FieldBeeForm!F12>0.001,2,IF(FieldBeeForm!E8>0.1,2,IF(FieldBeeForm!E8>0,1,0)))))))))))","v":4},6,{"$f":"+D12/E12","v":0.66666666666666663},20,{"$f":"+F12*G12","v":13.333333333333332},{"$f":"+H12/G12","v":0.66666666666666663},null,"Size bin scoring is set at: 10% of farm acreage or 10 ac = 6; 5.1 to 10% or 4.1 to 10 ac =5; 3.1 to 5% or 1 to 4 ac =4; 1 to 3% or 0.5 to 1 ac =3; <1% or 0.10 to 0.5 acres = 2; >0 to 0.1 = 1, 0 = 0. The actual acreage of land providing pollinator habitat is important and directly, linearly related to population size that can be supported. Maximum 'credit' is given to 10% of the farm area size and/or 10 acres or more. Total acreage applied to the Project is weighted as 57% of the overall Project Area Site Capacity Score.","Morandin and Winston 2006, Kremen et al. 2004, NRCS 2009"," "]
["Management: Insecticide use",{"$f":"OfficeForm!B34","v":3},"Are pesticides (insecticides, fungicides, etc.) used 2 or more times a year, between Mar. 1st & Nov. 1st within the PA and a 50-foot buffer?",{"$f":"+IF(OfficeForm!D34=1, 0, 1)","v":0},1,{"$f":"D13/E13","v":0},1.5,{"$f":"+F13*G13","v":0},{"$f":"H13/G13","v":0},null,"Insecticides are generally harmful to bees; fungicides may or may not be harmful, but often in combination with insecticides have been shown to increase the negative effect of the pesticide. One kilometer (roughly equal to 0.5 mi)is generally cited as the average foraging distance of native bees; thus, insecticides used within that range could directly harm bees.","Johanson 1977, Thompson 2003, Decourty et al. 2004, Desneux et al. 2007, Schmuck et al. 2003, Pilling et al. 1995, NRCS 2009, Zhong et al. 2004, Xerces Society for Invertebrate Conservation 2011, Everich et al. 2009"]
[null,"3b","Are pesticides (insecticides, fungicides, etc.) used 2 or more times a year, between Mar. 1st & Nov. 1st in the 0.5 mi buffer around the Project Area?",{"$f":"+IF(OfficeForm!E34=1, 0,1)","v":1},1,{"$f":"D14/E14","v":1},0.75,0.75,1]
[null,"4a","If insecticides are used 2+ times a year (between Mar. 1st & Nov. 1st), are broad-spectrum or soil fumigants used, or any pesticides that are labeled toxic to honeybees within the PA and a 50-foot buffer?",{"$f":"+IF(OfficeForm!D35=1, 0, 1)","v":0},1,{"$f":"D15/E15","v":0},1.5,0,0,null,"Research has shown that the use of multiple insecticides may have compounding effects on bees.","Johansen 1977, NRCS 2009, Xerces Society for Invertebrate Conservation 2011"]
[null,"4b","If insecticides are used 2+ times a year (between Mar. 1st & Nov. 1st), are broad-spectrum or soil fumigants used, or any pesticides that are labeled toxic to honeybees in the 0.5 mi buffer around the Project Area?",{"$f":"+IF(OfficeForm!E35=1, 0,1)","v":1},1,{"$f":"D16/E16","v":1},0.75,0.75,1]
[null,"5a","If insecticides are used 2+ times a year (between Mar. 1st & Nov. 1st), are they used outside crop blooming within the PA and a 50-foot buffer?",{"$f":"+OfficeForm!D36","v":0},1,0,1.5,0,0,null,"Insecticides used during crop blooming period are more likely to affect a greater percentage of bees, particularly managed honey bees.","NRCS 2009, Xerces Society for Invertebrate Conservation 2011"]
[null,"5b","If insecticides are used 2+ times a year (between Mar. 1st & Nov. 1st), are they used outside crop blooming in the 0.5 mi buffer around the Project Area?",{"$f":"+OfficeForm!E36","v":0},1,0,0.75,0,0]
[null,"6a","If insecticides are used 2+ times a year (between Mar. 1st & Nov. 1st), are they only used when bees are not active (i.e., at night) within the PA and a 50-foot buffer?",{"$f":"OfficeForm!D37","v":0},1,0,1.5,0,0,null,"Insecticides used during the day are more likely to directly harm bees.","Riedl et al. 2006, Tew 1997, Johansen and Mayer 1990, NRCS 2009, Xerces Society for Invertebrate Conservation 2011"]
[null,"6b","If insecticides are used 2+ times a year (between Mar. 1st & Nov. 1st), are they only used when bees are not active (i.e., at night) in the 0.5 mi buffer around the Project Area?",{"$f":"OfficeForm!E37","v":0},1,0,0.75,0,0]
[null,"7a","If insecticides are used 2+ times a year (between Mar. 1st & Nov. 1st), what is the application method within the PA and a 50-foot buffer?",{"$f":"+OfficeForm!D38","v":1},4,0.25,1.5,0.375,0.25,null,"Precision insecticide applications are thought to have relatively fewer impacts to bees. The more site-specific the application method, the more likely the insecticide will fall on weeds, rather than pollinator floral resources. Aerial spraying affects the greatest range and extent of floral resources for pollinators.","Ozkan 2000, NRCS 2009, Xerces Society for Invertebrate Conservation 2011"]
[null,"7b","If insecticides are used 2+ times a year (between Mar. 1st & Nov. 1st), what is the application method in the 0.5 mi buffer around the Project Area?",{"$f":"+OfficeForm!E38","v":0},4,0,1,0,0]
[null,null,"Subtotal Insecticide Use Score",null,null,null,{"$f":"+SUM(G13:G22)","v":11.5},{"$f":"+SUM(H13:H22)","v":1.875},{"$f":"+H23/G23","v":0.16304347826086957},null,"This subsection of \"Insecticide use\" was weighted as 33% of the total Project Area Site Capacity score."]
["Managed Bees",8,"Do you host managed honeybees anytime except winter (Nov-Feb) and/or during crop bloom time?",{"$f":"IF(OfficeForm!D40=0, 1, 0)","v":1},1,{"$f":"D24/E24","v":1},0,0," ",null,"Managed honeybees can compete with native pollinators for floral resources and impact native bee populations if there is a large mismatch between nectar sources and the number of bees during any given season. Honeybees kept near native vegetation during non-crop blooming periods will forage on other available source and when managed bees are maintained in high densities during these periods of lower floral resources, can negatively affect native pollinator populations.","NRCS 2009, Xerces Society for Invertebrate Conservation 2011, Badano and Vergara 2011"]
[null,9,"If you answered ‘Yes’ to #8, are the managed bee hives within the Project Area or the 2 mile buffer of the Project Area?",{"$f":"IF(OfficeForm!D41=0, 1, 0)","v":1},1,{"$f":"D25/E25","v":1},0,0," "]
[null,10,"If you answered ‘Yes’ to #9, is there more than 1 hive of managed bees per acre of habitat within PA and a 2 mi buffer, where habitat can include both PA and permanently protected other habitat? ",{"$f":"IF(OfficeForm!D42=0, 1, 0)","v":1},1,1,0,0," "]
[null,11,"If you answered ‘Yes’ to #10, write down how many hives you have/host within a the PA and within a 2 mi buffer during the non-winter and no crop bloom periods.",{"$f":"IF(OfficeForm!D43<2,4,IF(OfficeForm!D43<3,3,IF(OfficeForm!D43<5,2,(IF(OfficeForm!D43<7,1,0)))))","v":4},4,1,3.5,{"$f":"+F27*G27","v":3.5},1,null,"If honeybees are located within foraging range (2 mi for European honey bee) of pollinator habitat (rather than in the cropped area), they may outcompete native bees for the limited floral resources. 100% credit for <2 hives; 75% for <3 hives, 50% for <5 hives, 25% for <7 hives, and 0% for >7 hives","Jessa Guisse of Xerxes Society, pers. comm. with Amy Merrill of Stillwater Sciences, Mitchell et al. 2009, Badano and Vergara 2011"]
[null,null,"Subtotal Sum of Management: Managed Bees Weights and Scores",null,null,null,{"$f":"SUM(G24:G27)","v":3.5},{"$f":"SUM(H24:H27)","v":3.5},1,null,"This subsection of \"Managed Bees\" was weighted as 10% of the total Site Capacity score."," "]
[null,null,"Project Area Site Capacity SCORE",null,null,null,{"$f":"+G12+G23+G28","v":35},{"$f":"+SUM(H13:H25)+ SUM(H27:H27)","v":7.25},{"$f":"+H29/G29","v":0.20714285714285716},null," "]
[null,null,"Site Capacity Scoring per Map Unit"]
[{"$f":"+FieldBeeForm!A18","v":1},null,"Map Unit Number:",{"$f":"+FieldBeeForm!A18","v":1},"Map Unit Acres:",null,null,{"$f":"FieldBeeForm!H17","v":0.30280073461891643}]
["Map Unit Characteristics",{"$f":"+FieldBeeForm!C$13","v":"F"},"Acres of Map Unit",{"$f":"+FieldBeeForm!H17","v":0.30280073461891643},{"$f":"+FieldBeeForm!$E$12*0.1","v":10},{"$f":"+D32/E32","v":3.0280073461891644E-2},6,{"$f":"+F32*G32","v":0.18168044077134987},{"$f":"H32/G32","v":3.0280073461891644E-2},null,"The more area of the Map Unit that provides nesting and/or foraging habitat for the pollinators, the better. Credit assigned linearly up to 10% of the total farm area (maximum).","Zurbuchen et al 2008, NRCS 2009"," "]
[null,{"$f":"+FieldBeeForm!C$15","v":"G"},"Percent of Map Unit that is covered with pollinator habitat",{"$f":"+IF(FieldBeeForm!E15<1, 0, IF(FieldBeeForm!E15<10, 1, IF(FieldBeeForm!E15<25, 2, IF(FieldBeeForm!E15<50, 3, IF(FieldBeeForm!E15<75, 4, IF(FieldBeeForm!E15< 85, 5, 6))))))","v":4},6,0.66666666666666663,6,4,0.66666666666666663,null,"Higher density habitat, vs. diffuse habitat, reduces energy required for pollinators and is therefore also better habitat. Bins set at <1, 1-10, 10-25, 25-50, 50-75, 75-85, >85.","NRCS 2009, Sim and Baltus 1987"," "]
[null,null,"Combined sum of Map Unit extent and density scores",null,null,null,{"$f":"+SUM(G32:G33)","v":12},{"$f":"+SUM(H32:H33)","v":4.1816804407713501},{"$f":"H34/G34","v":0.3484733700642792}]
["Floral resources",{"$f":"FieldBeeForm!C19","v":12},{"$f":"FieldBeeForm!D19","v":"Number of different flowering plant species present during early-blooming (Feb-May) period"},{"$f":"IF(FieldBeeForm!G19>=5, 5, FieldBeeForm!G19)","v":5},5,1,2,2,1,null,"Research has shown that it is ideal to have 5 or more flowering plant species present during all seasons (the greater diversity of plants, the greater abundance and diversity of bees).","NRCS 2009, Bosch and Kemp 2001, Pontin et al. 2006, Holcomb 2009, Pywell et al. 2005"]
[null,{"$f":"FieldBeeForm!C20","v":13},{"$f":"FieldBeeForm!D20","v":"Number of different flowering plants present during mid-blooming (Jun-Jul) period"},{"$f":"IF(FieldBeeForm!G20>=5, 5, FieldBeeForm!G20)","v":5},5,1,2,2,1]
[null,{"$f":"FieldBeeForm!C21","v":14},{"$f":"FieldBeeForm!D21","v":"Number of different flowering plants present during late-blooming (Aug-Jan) period"},{"$f":"IF(FieldBeeForm!G21>=5, 5, FieldBeeForm!G21)","v":5},5,1,2,2,1]
[null,{"$f":"FieldBeeForm!C22","v":15},{"$f":"FieldBeeForm!D22","v":"Estimated surface area of flowering plants present during early-blooming (Feb-May) period"},{"$f":"IF(FieldBeeForm!I22=0,0,IF(FieldBeeForm!I22<0.05,1,IF(FieldBeeForm!I22<0.1,2,IF(FieldBeeForm!I22<0.15,3,IF(FieldBeeForm!I22<0.2,4,IF(FieldBeeForm!I22<0.25,5,6))))))","v":1},6,0.16666666666666666,1,0.16666666666666666,0.16666666666666666,null,"Having floral resources available throughout the year supports diversity of pollinator species. Scoring is set at 0, 1 to 5, 5 to 10, 10 to 15, 15 to 20, 20 to 25, and over 25% for maximum score.","Zurbuchen et al 2008, NRCS 2009, Holcomb 2009, Pywell et al. 2005"," "]
[null,{"$f":"FieldBeeForm!C23","v":16},{"$f":"FieldBeeForm!D23","v":"Estimated surface area of flowering plants present during mid-blooming (Jun-Jul) period"},{"$f":"IF(FieldBeeForm!I23=0,0,IF(FieldBeeForm!I23<0.05,1,IF(FieldBeeForm!I23<0.1,2,IF(FieldBeeForm!I23<0.15,3,IF(FieldBeeForm!I23<0.2,4,IF(FieldBeeForm!I23<0.25,5,6))))))","v":1},6,0.16666666666666666,1,0.16666666666666666,0.16666666666666666]
[null,{"$f":"FieldBeeForm!C24","v":17},{"$f":"FieldBeeForm!D24","v":"Estimated surface area of flowering plants present during late-blooming (Aug-Jan) period"},{"$f":"IF(FieldBeeForm!I24=0,0,IF(FieldBeeForm!I24<0.05,1,IF(FieldBeeForm!I24<0.1,2,IF(FieldBeeForm!I24<0.15,3,IF(FieldBeeForm!I24<0.2,4,IF(FieldBeeForm!I24<0.25,5,6))))))","v":1},6,0.16666666666666666,1,0.16666666666666666,0.16666666666666666,null,null,null," "]
[null,null,"Combined coverage of floral resources",{"$f":"+IF(SUM(FieldBeeForm!I22:I24)<0,0, IF(SUM(FieldBeeForm!I22:I24)<0.05, 1, IF(SUM(FieldBeeForm!I22:I24)<0.1, 2, IF(SUM(FieldBeeForm!I22:I24)<0.2, 3, IF(SUM(FieldBeeForm!I22:I24)<0.5, 4, IF(SUM(FieldBeeForm!I22:I24)<0.75, 5, 6))))))","v":1},6,0.16666666666666666,3,0.5,0.16666666666666666]
[null,null,"Sum of Floral Resouces Weights and Scores",null,null,null,{"$f":"SUM(G35:G41)","v":12},{"$f":"SUM(H35:H41)","v":7.0000000000000009},{"$f":"H42/G42","v":0.58333333333333337},null,"This section of \"Floral Resources\" was weighted as approximately 1/4 of the total Map Unit score."]
["Nesting materials",{"$f":"FieldBeeForm!C25","v":18},{"$f":"FieldBeeForm!D25","v":"Percent cover of friable bare ground present"},{"$f":"FieldBeeForm!E25","v":5.5E-2},0.3,{"$f":"+D43/E43","v":0.18333333333333335},3,{"$f":"+F43*G43","v":0.55000000000000004},0.18333333333333335,null,"70% native bees nest in soil.","Morandin and Winston 2006, Carvell 2004, Potts et al. 2005, Xerces Society for Invertebrate Conservation Society for Invertebrate Conservation 2011"," "]
[null,{"$f":"FieldBeeForm!C28","v":"19 and 20"},{"$f":"FieldBeeForm!D28","v":"Amount of rodent holes and/or bunch grasses"},{"$f":"FieldBeeForm!E28","v":1},2,{"$f":"+D44/E44","v":0.5},2,{"$f":"+F44*G44","v":1},0.5,null,"30% native bees nest in cavities including blue orchard bees.","Thorp et al. 1983, Kearns and Thomson 2001, McFrederick and LeBuhn 2006"]
[null,{"$f":"FieldBeeForm!C32","v":"21, 22 and 23"},{"$f":"FieldBeeForm!D32","v":"Amount of snags/stumps, nest boxes/bundles, pithy tissue"},{"$f":"FieldBeeForm!E32","v":1},2,{"$f":"+D45/E45","v":0.5},2,{"$f":"+F45*G45","v":1},0.5,null,"Bumble bees often nest or overwinter in rodent holes or within bunch grasses.","Bosch and Kemp 2001; Michener 2000; Xerces Society for Invertebrate Conservation Society for Invertebrate Conservation 2011; "]
[null,{"$f":"FieldBeeForm!C33","v":"18 through 23"},{"$f":"FieldBeeForm!D33","v":"Diversity of available nesting materials"},{"$f":"FieldBeeForm!E33","v":0.66666666666666663},1,{"$f":"+D46/E46","v":0.66666666666666663},5,{"$f":"+F46*G46","v":3.333333333333333},0.66666666666666663,null,"A diversity of nesting materials will support a diversity of pollinators.","Tscharntke et al. 1998, Cane 2001, Potts et al. 2005, Westrich 1996"]
[null,null,"Sum of Nesting Materials Weights and Scores",null,null,null,{"$f":"SUM(G43:G46)","v":12},{"$f":"SUM(H43:H46)","v":5.8833333333333329},{"$f":"H47/G47","v":0.49027777777777776},null,"This section of \"Nesting materials\" was weighted as approximately 1/4 of the total Map Unit score."]
["Management: Soil disturbance",{"$f":"FieldBeeForm!C34","v":24},"Is the Map Unit tilled at some point during the year? (0 = yes)",{"$f":"IF(FieldBeeForm!E34=0,1,0)","v":0},1,{"$f":"+D48/E48","v":0},1,{"$f":"+F48*G48","v":0},0,null,"Soil tilling disturbs ground nesting bees and favors aggressive nonnative plants.","Shuler et al. 2005, NRCS 2009, Xerces Society for Invertebrate Conservation 2011"]
[null,{"$f":"FieldBeeForm!C35","v":25},"Is the Map Unit flood-irrigated at some point during the year? (0 = yes)",{"$f":"IF(FieldBeeForm!E35=0,1,0)","v":1},1,{"$f":"+D49/E49","v":1},1,{"$f":"+F49*G49","v":1},1,null,"Flood irrigation drowns the underground life stages of ground nesting bees.","Vaughn et al. 2007, NRCS 2009, Xerces Society for Invertebrate Conservation 2011"]
[null,{"$f":"FieldBeeForm!C36","v":26},"Is plastic mulching used at the Map Unit? (0 = yes)",{"$f":"IF(FieldBeeForm!E36=0,1,0)","v":0},1,0,1,{"$f":"+F50*G50","v":0},0,null,"Plastic mulching traps the underground life stages of ground nesting bees.","NRCS 2009, Xerces Society for Invertebrate Conservation 2011"]
[null,{"$f":"FieldBeeForm!C37","v":27},"Does road-grading or road-making occur on the Map Unit? (0 = yes)",{"$f":"IF(FieldBeeForm!E37=0,1,0)","v":0},1,0,1,{"$f":"+F51*G51","v":0},0,null,"Road-grading/making distrubs the underground life stages of ground nesting bees.","NRCS 2009, Xerces Society for Invertebrate Conservation 2011"]
[null,{"$f":"FieldBeeForm!C38","v":28},"Total percent cover of map unit that does NOT experience soil disturbance.",{"$f":"1-FieldBeeForm!E38","v":0.4},1,{"$f":"+D52/E52","v":0.4},2,{"$f":"+F52*G52","v":0.8},0.4,null,"The less of the site with ground disturbance, the less the impact to bees.","NRCS 2009, Xerces Society for Invertebrate Conservation 2011"]
[null,null,"Subtotal Sum of Management: Soil Disturbance Weights and Scores",null,null,null,{"$f":"SUM(G48:G52)","v":6},{"$f":"SUM(H48:H52)","v":1.8},{"$f":"H53/G53","v":0.3},null,"This subsection of \"Soil disturbance\" was weighted as 12.5% of the total Map Unit score."]
["Management: Vegetation/ground disturbance",{"$f":"FieldBeeForm!C39","v":29},"Total cover NOT covered by invasive noxious weeds",{"$f":"1-FieldBeeForm!E39","v":1},1,{"$f":"+D54/E54","v":1},1,{"$f":"+F54*G54","v":1},1,null,"Aggressive nonnative plant species reduce overall plant diversity, which influences bee diversity.","Williams et al. 2010, NRCS 2009, Bosch and Kemp 2001, Pontin et al. 2006, Holcomb 2009, Pywell et al. 2005"," "]
[null,{"$f":"FieldBeeForm!C40","v":30},"FIVE MINUS the number of invasive noxious weed species",{"$f":"5-FieldBeeForm!E40","v":0},5,{"$f":"+D55/E55","v":0},1,0,0]
[null,{"$f":"FieldBeeForm!C41","v":31},"Percent of the Map Unit NOT burned during the blooming season (Feb through Sept)",{"$f":"1-FieldBeeForm!E41","v":1},1,1,1,1,1,null,"Burning disturbs ground nesting bees and floral resources.","Black et al. 2008, Hartley et al. 2007, Smallidge and Leopold 1997, Manguira and Thomas 1992,  NRCS 2009, Xerces Society for Invertebrate Conservation 2011"]
[null,{"$f":"FieldBeeForm!C42","v":32},"Percent of the Map Unit NOT mowed and/or hayed during the blooming season (Feb through Sept)",{"$f":"1-FieldBeeForm!E42","v":0.9},1,0.9,1,0.9,0.9,null,"Mowing/haying disturbs ground nesting bees and floral resources."]
[null,{"$f":"FieldBeeForm!C43","v":33},"Total percent of the Map Unit NOT burned, mowed, or hayed during the blooming season",{"$f":"1-FieldBeeForm!E43","v":0.7},1,0.7,2,{"$f":"+F58*G58","v":1.4},{"$f":"H58/G58","v":0.7},null,"The less of the site with vegetation/soil disturbance, the less the impact to bees."]
[null,null,"Subtotal Sum of Management: Vegetation/Ground Disturbance Weights and Scores",null,null,null,{"$f":"SUM(G54:G58)","v":6},{"$f":"SUM(H54:H58)","v":4.3},{"$f":"H59/G59","v":0.71666666666666667},null,"This subsection of \"Vegetation/Ground disturbance\" was weighted as 12.5% of the total Map Unit score."]
[null,null,"TOTAL Sum of Management",null,null,null,{"$f":"G53+G59","v":12},{"$f":"H53+H59","v":6.1},{"$f":"H60/G60","v":0.5083333333333333},null,"This section of \"Management\" was weighted as approximately 1/4 of the total Map Unit score."]
[null,null,"Map Unit SCORE",null,null,null,{"$f":"+G34+G42+G47+G60","v":48},{"$f":"+H34+H42+H47+H60","v":23.165013774104686},{"$f":"H61/G61","v":0.48260445362718096}]
[null,null,"Map Unit ",{"$f":"D31","v":1},"Combined Score for this Map Unit and Project Area Capacity",null,null,null,{"$f":"0.4*I61+0.6*$I$29","v":0.3173274957365867},{"$f":"I62*H31","v":9.6086998823819519E-2}]
["Combined Acres for Map Units:",{"$f":"H31","v":0.30280073461891643},null,null,"Combined Score for all Map Units to this point with the Project Area Capacity",null,null,null,{"$f":"0.4*((I$61*B$63)/SUM(B$63))+0.6*I$29","v":0.31732749573658664},{"$f":"I63*B63","v":9.6086998823819506E-2}]
[]
[]
[]
[]
[]
[]
[]
[]
[]
[]
[]
[]
[]
[]
[]
[]
[]
[]
[]
[]
[{"$f":"+FieldBeeForm!A71","v":2},null,"Map Unit Number:",{"$f":"+FieldBeeForm!A71","v":2},"Map Unit Acres:",null,null,{"$f":"FieldBeeForm!H70","v":1.1478420569329659}]
["Map Unit Characteristics",{"$f":"+FieldBeeForm!C$13","v":"F"},"Acres of Map Unit",{"$f":"+FieldBeeForm!H70","v":1.1478420569329659},{"$f":"+FieldBeeForm!$E$12*0.1","v":10},{"$f":"+D85/E85","v":0.11478420569329659},6,{"$f":"+F85*G85","v":0.68870523415977947},{"$f":"H85/G85","v":0.11478420569329657},null,"The more area of the Map Unit that provides nesting and/or foraging habitat for the pollinators, the better. Credit assigned linearly up to 10% of the total farm area (maximum).","Zurbuchen et al 2008, NRCS 2009"," "]
[null,{"$f":"+FieldBeeForm!C$15","v":"G"},"Percent of Map Unit that is covered with pollinator habitat",{"$f":"+IF(FieldBeeForm!E68<1, 0, IF(FieldBeeForm!E68<10, 1, IF(FieldBeeForm!E68<25, 2, IF(FieldBeeForm!E68<50, 3, IF(FieldBeeForm!E68<75, 4, IF(FieldBeeForm!E68< 85, 5, 6))))))","v":0},6,0,6,0,0,null,"Higher density habitat, vs. diffuse habitat, reduces energy required for pollinators and is therefore also better habitat. Bins set at <1, 1-10, 10-25, 25-50, 50-75, 75-85, >85.","NRCS 2009, Sim and Baltus 1987"," "]
[null,null,"Combined sum of Map Unit extent and density scores",null,null,null,{"$f":"+SUM(G85:G86)","v":12},{"$f":"+SUM(H85:H86)","v":0.68870523415977947},{"$f":"H87/G87","v":5.7392102846648287E-2}]
["Floral resources",{"$f":"FieldBeeForm!C72","v":12},{"$f":"FieldBeeForm!D72","v":"Number of different flowering plant species present during early-blooming (Feb-May) period"},{"$f":"IF(FieldBeeForm!G72>=5, 5, FieldBeeForm!G72)","v":5},5,{"$f":"+D88/E88","v":1},2,{"$f":"+F88*G88","v":2},{"$f":"H88/G88","v":1},null,"Research has shown that it is ideal to have 5 or more flowering plant species present during all seasons (the greater diversity of plants, the greater abundance and diversity of bees).","NRCS 2009, Bosch and Kemp 2001, Pontin et al. 2006, Holcomb 2009, Pywell et al. 2005"]
[null,{"$f":"FieldBeeForm!C73","v":13},{"$f":"FieldBeeForm!D73","v":"Number of different flowering plants present during mid-blooming (Jun-Jul) period"},{"$f":"IF(FieldBeeForm!G73>=5, 5, FieldBeeForm!G73)","v":5},5,1,2,2,1]
[null,{"$f":"FieldBeeForm!C74","v":14},{"$f":"FieldBeeForm!D74","v":"Number of different flowering plants present during late-blooming (Aug-Jan) period"},{"$f":"IF(FieldBeeForm!G74>=5, 5, FieldBeeForm!G74)","v":5},5,1,2,2,1]
[null,{"$f":"FieldBeeForm!C75","v":15},{"$f":"FieldBeeForm!D75","v":"Estimated surface area of flowering plants present during early-blooming (Feb-May) period"},{"$f":"IF(FieldBeeForm!I75=0,0,IF(FieldBeeForm!I75<0.05,1,IF(FieldBeeForm!I75<0.1,2,IF(FieldBeeForm!I75<0.15,3,IF(FieldBeeForm!I75<0.2,4,IF(FieldBeeForm!I75<0.25,5,6))))))","v":0},6,0,1,0,0,null,"Having floral resources available throughout the year supports diversity of pollinator species. Scoring is set at 0, 1 to 5, 5 to 10, 10 to 15, 15 to 20, 20 to 25, and over 25% for maximum score.","Zurbuchen et al 2008, NRCS 2009, Holcomb 2009, Pywell et al. 2005"," "]
[null,{"$f":"FieldBeeForm!C76","v":16},{"$f":"FieldBeeForm!D76","v":"Estimated surface area of flowering plants present during mid-blooming (Jun-Jul) period"},{"$f":"IF(FieldBeeForm!I76=0,0,IF(FieldBeeForm!I76<0.05,1,IF(FieldBeeForm!I76<0.1,2,IF(FieldBeeForm!I76<0.15,3,IF(FieldBeeForm!I76<0.2,4,IF(FieldBeeForm!I76<0.25,5,6))))))","v":0},6,0,1,0,0]
[null,{"$f":"FieldBeeForm!C77","v":17},{"$f":"FieldBeeForm!D77","v":"Estimated surface area of flowering plants present during late-blooming (Aug-Jan) period"},{"$f":"IF(FieldBeeForm!I77=0,0,IF(FieldBeeForm!I77<0.05,1,IF(FieldBeeForm!I77<0.1,2,IF(FieldBeeForm!I77<0.15,3,IF(FieldBeeForm!I77<0.2,4,IF(FieldBeeForm!I77<0.25,5,6))))))","v":0},6,0,1,0,0,null,null,null," "]
[null,null,"Combined coverage of floral resources",{"$f":"+IF(SUM(FieldBeeForm!I75:I77)<0,0, IF(SUM(FieldBeeForm!I75:I77)<0.05, 1, IF(SUM(FieldBeeForm!I75:I77)<0.1, 2, IF(SUM(FieldBeeForm!I75:I77)<0.2, 3, IF(SUM(FieldBeeForm!I75:I77)<0.5, 4, IF(SUM(FieldBeeForm!I75:I77)<0.75, 5, 6))))))","v":1},6,0.16666666666666666,3,0.5,0.16666666666666666]
[null,null,"Sum of Floral Resouces Weights and Scores",null,null,null,{"$f":"SUM(G88:G94)","v":12},{"$f":"SUM(H88:H94)","v":6.5},{"$f":"H95/G95","v":0.54166666666666663},null,"This section of \"Floral Resources\" was weighted as approximately 1/4 of the total Map Unit score."," "]
["Nesting materials",{"$f":"FieldBeeForm!C78","v":18},{"$f":"FieldBeeForm!D78","v":"Percent cover of friable bare ground present"},{"$f":"FieldBeeForm!E78","v":5.5E-2},0.3,{"$f":"+D96/E96","v":0.18333333333333335},3,{"$f":"+F96*G96","v":0.55000000000000004},{"$f":"H96/G96","v":0.18333333333333335},null,"70% native bees nest in soil.","Morandin and Winston 2006, Carvell 2004, Potts et al. 2005, Xerces Society for Invertebrate Conservation Society for Invertebrate Conservation 2011"," "]
[null,{"$f":"FieldBeeForm!C81","v":"19 and 20"},{"$f":"FieldBeeForm!D81","v":"Amount of rodent holes and/or bunch grasses"},{"$f":"FieldBeeForm!E81","v":1},2,{"$f":"+D97/E97","v":0.5},2,{"$f":"+F97*G97","v":1},0.5,null,"30% native bees nest in cavities including blue orchard bees.","Thorp et al. 1983, Kearns and Thomson 2001, McFrederick and LeBuhn 2006"]
[null,{"$f":"FieldBeeForm!C85","v":"21, 22 and 23"},{"$f":"FieldBeeForm!D85","v":"Amount of snags/stumps, nest boxes/bundles, pithy tissue"},{"$f":"FieldBeeForm!E85","v":1},2,{"$f":"+D98/E98","v":0.5},2,{"$f":"+F98*G98","v":1},0.5,null,"Bumble bees often nest or overwinter in rodent holes or within bunch grasses.","Bosch and Kemp 2001; Michener 2000; Xerces Society for Invertebrate Conservation Society for Invertebrate Conservation 2011; "]
[null,{"$f":"FieldBeeForm!C86","v":"18 through 23"},{"$f":"FieldBeeForm!D86","v":"Diversity of available nesting materials"},{"$f":"FieldBeeForm!E86","v":0.66666666666666663},1,{"$f":"+D99/E99","v":0.66666666666666663},5,{"$f":"+F99*G99","v":3.333333333333333},0.66666666666666663,null,"A diversity of nesting materials will support a diversity of pollinators.","Tscharntke et al. 1998, Cane 2001, Potts et al. 2005, Westrich 1996"]
[null,null,"Sum of Nesting Materials Weights and Scores",null,null,null,{"$f":"SUM(G96:G99)","v":12},{"$f":"SUM(H96:H99)","v":5.8833333333333329},{"$f":"H100/G100","v":0.49027777777777776},null,"This section of \"Nesting materials\" was weighted as approximately 1/4 of the total Map Unit score."," "]
["Management: Soil disturbance",{"$f":"FieldBeeForm!C87","v":24},"Is the Map Unit tilled at some point during the year? (0 = yes)",{"$f":"IF(FieldBeeForm!E87=0,1,0)","v":0},1,{"$f":"+D101/E101","v":0},1,{"$f":"+F101*G101","v":0},{"$f":"H101/G101","v":0},null,"Soil tilling disturbs ground nesting bees and favors aggressive nonnative plants.","Shuler et al. 2005, NRCS 2009, Xerces Society for Invertebrate Conservation 2011"]
[null,{"$f":"FieldBeeForm!C88","v":25},"Is the Map Unit flood-irrigated at some point during the year? (0 = yes)",{"$f":"IF(FieldBeeForm!E88=0,1,0)","v":1},1,{"$f":"+D102/E102","v":1},1,{"$f":"+F102*G102","v":1},1,null,"Flood irrigation drowns the underground life stages of ground nesting bees.","Vaughn et al. 2007, NRCS 2009, Xerces Society for Invertebrate Conservation 2011"]
[null,{"$f":"FieldBeeForm!C89","v":26},"Is plastic mulching used at the Map Unit? (0 = yes)",{"$f":"IF(FieldBeeForm!E89=0,1,0)","v":0},1,0,1,{"$f":"+F103*G103","v":0},0,null,"Plastic mulching traps the underground life stages of ground nesting bees.","NRCS 2009, Xerces Society for Invertebrate Conservation 2011"]
[null,{"$f":"FieldBeeForm!C90","v":27},"Does road-grading or road-making occur on the Map Unit? (0 = yes)",{"$f":"IF(FieldBeeForm!E90=0,1,0)","v":0},1,0,1,{"$f":"+F104*G104","v":0},0,null,"Road-grading/making distrubs the underground life stages of ground nesting bees.","NRCS 2009, Xerces Society for Invertebrate Conservation 2011"]
[null,{"$f":"FieldBeeForm!C91","v":28},"Total percent cover of map unit that does NOT experience soil disturbance.",{"$f":"1-FieldBeeForm!E91","v":0.4},1,{"$f":"+D105/E105","v":0.4},2,{"$f":"+F105*G105","v":0.8},0.4,null,"The less of the site with ground disturbance, the less the impact to bees.","NRCS 2009, Xerces Society for Invertebrate Conservation 2011"]
[null,null,"Subtotal Sum of Management: Soil Disturbance Weights and Scores",null,null,null,{"$f":"SUM(G101:G105)","v":6},{"$f":"SUM(H101:H105)","v":1.8},{"$f":"H106/G106","v":0.3},null,"This subsection of \"Soil disturbance\" was weighted as 12.5% of the total Map Unit score."]
["Management: Vegetation/ground disturbance",{"$f":"FieldBeeForm!C92","v":29},"Total cover NOT covered by invasive noxious weeds",{"$f":"1-FieldBeeForm!E92","v":1},1,{"$f":"+D107/E107","v":1},1,{"$f":"+F107*G107","v":1},{"$f":"H107/G107","v":1},null,"Aggressive nonnative plant species reduce overall plant diversity, which influences bee diversity.","Williams et al. 2010, NRCS 2009, Bosch and Kemp 2001, Pontin et al. 2006, Holcomb 2009, Pywell et al. 2005"," "]
[null,{"$f":"FieldBeeForm!C93","v":30},"FIVE MINUS the number of invasive noxious weed species",{"$f":"5-FieldBeeForm!E93","v":0},5,{"$f":"+D108/E108","v":0},1,0,0]
[null,{"$f":"FieldBeeForm!C94","v":31},"Percent of the Map Unit NOT burned during the blooming season (Feb through Sept)",{"$f":"1-FieldBeeForm!E94","v":1},1,1,1,1,1,null,"Burning disturbs ground nesting bees and floral resources.","Black et al. 2008, Hartley et al. 2007, Smallidge and Leopold 1997, Manguira and Thomas 1992,  NRCS 2009, Xerces Society for Invertebrate Conservation 2011"]
[null,{"$f":"FieldBeeForm!C95","v":32},"Percent of the Map Unit NOT mowed and/or hayed during the blooming season (Feb through Sept)",{"$f":"1-FieldBeeForm!E95","v":0.9},1,0.9,1,0.9,0.9,null,"Mowing/haying disturbs ground nesting bees and floral resources."]
[null,{"$f":"FieldBeeForm!C96","v":33},"Total percent of the Map Unit NOT burned, mowed, or hayed during the blooming season",{"$f":"1-FieldBeeForm!E96","v":0.7},1,0.7,2,{"$f":"+F111*G111","v":1.4},{"$f":"H111/G111","v":0.7},null,"The less of the site with vegetation/soil disturbance, the less the impact to bees."]
[null,null,"Subtotal Sum of Management: Vegetation/Ground Disturbance Weights and Scores",null,null,null,{"$f":"SUM(G107:G111)","v":6},{"$f":"SUM(H107:H111)","v":4.3},{"$f":"H112/G112","v":0.71666666666666667},null,"This subsection of \"Vegetation/Ground disturbance\" was weighted as 12.5% of the total Map Unit score."]
[null,null,"TOTAL Sum of Management",null,null,null,{"$f":"G106+G112","v":12},{"$f":"H106+H112","v":6.1},{"$f":"H113/G113","v":0.5083333333333333},null,"This section of \"Management\" was weighted as approximately 1/4 of the total Map Unit score."," "]
[null,null,"Map Unit SCORE",null,null,null,{"$f":"(SUM(G87,G95,G100,G113,))","v":48},{"$f":"(SUM(H87,H95,H100,H113,))","v":19.172038567493111},{"$f":"H114/G114","v":0.39941747015610646}]
[null,null,"Map Unit ",{"$f":"D84","v":2},"Combined Score for this Map Unit and Project Area Capacity",null,null,null,{"$f":"0.4*I114+0.6*$I$29","v":0.28405270234815688},{"$f":"I115*H84","v":0.32604763814067594}," "]
["Combined Acres for Map Units:",{"$f":"H84","v":1.1478420569329659},null,null,"Combined Score for all Map Units to this point with the Project Area Capacity",null,null,null,{"$f":"0.4*((I$61*B$63+I$114*B$116)/SUM(B$116,B$63))+0.6*I$29","v":0.2909983349608074},{"$f":"I116*B116","v":0.33402012736548137}," "]
[]
[]
[]
[]
[]
[]
[]
[]
[]
[]
[]
[]
[]
[]
[]
[]
[]
[]
[]
[]
[{"$f":"+FieldBeeForm!A124","v":3},null,"Map Unit Number:",{"$f":"+FieldBeeForm!A124","v":3},"Map Unit Acres:",null,null,{"$f":"FieldBeeForm!H123","v":6.887052341597796}]
["Map Unit Characteristics",{"$f":"+FieldBeeForm!C$13","v":"F"},"Acres of Map Unit",{"$f":"+FieldBeeForm!H123","v":6.887052341597796},{"$f":"+FieldBeeForm!$E$12*0.1","v":10},{"$f":"+D138/E138","v":0.68870523415977958},6,{"$f":"+F138*G138","v":4.1322314049586772},{"$f":"H138/G138","v":0.68870523415977958},null,"The more area of the Map Unit that provides nesting and/or foraging habitat for the pollinators, the better. Credit assigned linearly up to 10% of the total farm area (maximum).","Zurbuchen et al 2008, NRCS 2009"," "]
[null,{"$f":"+FieldBeeForm!C$15","v":"G"},"Percent of Map Unit that is covered with pollinator habitat",{"$f":"+IF(FieldBeeForm!E121<1, 0, IF(FieldBeeForm!E121<10, 1, IF(FieldBeeForm!E121<25, 2, IF(FieldBeeForm!E121<50, 3, IF(FieldBeeForm!E121<75, 4, IF(FieldBeeForm!E121< 85, 5, 6))))))","v":0},6,0,6,0,0,null,"Higher density habitat, vs. diffuse habitat, reduces energy required for pollinators and is therefore also better habitat. Bins set at <1, 1-10, 10-25, 25-50, 50-75, 75-85, >85.","NRCS 2009, Sim and Baltus 1987"," "]
[null,null,"Combined sum of Map Unit extent and density scores",null,null,null,{"$f":"+SUM(G138:G139)","v":12},{"$f":"+SUM(H138:H139)","v":4.1322314049586772},{"$f":"H140/G140","v":0.34435261707988979}]
["Floral resources",{"$f":"FieldBeeForm!C125","v":12},{"$f":"FieldBeeForm!D125","v":"Number of different flowering plant species present during early-blooming (Feb-May) period"},{"$f":"IF(FieldBeeForm!G125>=5, 5, FieldBeeForm!G125)","v":5},5,{"$f":"+D141/E141","v":1},2,{"$f":"+F141*G141","v":2},{"$f":"H141/G141","v":1},null,"Research has shown that it is ideal to have 5 or more flowering plant species present during all seasons (the greater diversity of plants, the greater abundance and diversity of bees).","NRCS 2009, Bosch and Kemp 2001, Pontin et al. 2006, Holcomb 2009, Pywell et al. 2005"]
[null,{"$f":"FieldBeeForm!C126","v":13},{"$f":"FieldBeeForm!D126","v":"Number of different flowering plants present during mid-blooming (Jun-Jul) period"},{"$f":"IF(FieldBeeForm!G126>=5, 5, FieldBeeForm!G126)","v":5},5,1,2,2,1]
[null,{"$f":"FieldBeeForm!C127","v":14},{"$f":"FieldBeeForm!D127","v":"Number of different flowering plants present during late-blooming (Aug-Jan) period"},{"$f":"IF(FieldBeeForm!G127>=5, 5, FieldBeeForm!G127)","v":5},5,1,2,2,1]
[null,{"$f":"FieldBeeForm!C128","v":15},{"$f":"FieldBeeForm!D128","v":"Estimated surface area of flowering plants present during early-blooming (Feb-May) period"},{"$f":"IF(FieldBeeForm!I128=0,0,IF(FieldBeeForm!I128<0.05,1,IF(FieldBeeForm!I128<0.1,2,IF(FieldBeeForm!I128<0.15,3,IF(FieldBeeForm!I128<0.2,4,IF(FieldBeeForm!I128<0.25,5,6))))))","v":0},6,0,1,0,0,null,"Having floral resources available throughout the year supports diversity of pollinator species. Scoring is set at 0, 1 to 5, 5 to 10, 10 to 15, 15 to 20, 20 to 25, and over 25% for maximum score.","Zurbuchen et al 2008, NRCS 2009, Holcomb 2009, Pywell et al. 2005"," "]
[null,{"$f":"FieldBeeForm!C129","v":16},{"$f":"FieldBeeForm!D129","v":"Estimated surface area of flowering plants present during mid-blooming (Jun-Jul) period"},{"$f":"IF(FieldBeeForm!I129=0,0,IF(FieldBeeForm!I129<0.05,1,IF(FieldBeeForm!I129<0.1,2,IF(FieldBeeForm!I129<0.15,3,IF(FieldBeeForm!I129<0.2,4,IF(FieldBeeForm!I129<0.25,5,6))))))","v":0},6,0,1,0,0]
[null,{"$f":"FieldBeeForm!C130","v":17},{"$f":"FieldBeeForm!D130","v":"Estimated surface area of flowering plants present during late-blooming (Aug-Jan) period"},{"$f":"IF(FieldBeeForm!I130=0,0,IF(FieldBeeForm!I130<0.05,1,IF(FieldBeeForm!I130<0.1,2,IF(FieldBeeForm!I130<0.15,3,IF(FieldBeeForm!I130<0.2,4,IF(FieldBeeForm!I130<0.25,5,6))))))","v":0},6,0,1,0,0,null,null,null," "]
[null,null,"Combined coverage of floral resources",{"$f":"+IF(SUM(FieldBeeForm!I128:I130)<0,0, IF(SUM(FieldBeeForm!I128:I130)<0.05, 1, IF(SUM(FieldBeeForm!I128:I130)<0.1, 2, IF(SUM(FieldBeeForm!I128:I130)<0.2, 3, IF(SUM(FieldBeeForm!I128:I130)<0.5, 4, IF(SUM(FieldBeeForm!I128:I130)<0.75, 5, 6))))))","v":1},6,0.16666666666666666,3,0.5,0.16666666666666666]
[null,null,"Sum of Floral Resouces Weights and Scores",null,null,null,{"$f":"SUM(G141:G147)","v":12},{"$f":"SUM(H141:H147)","v":6.5},{"$f":"H148/G148","v":0.54166666666666663},null,"This section of \"Floral Resources\" was weighted as approximately 1/4 of the total Map Unit score."," "]
["Nesting materials",{"$f":"FieldBeeForm!C131","v":18},{"$f":"FieldBeeForm!D131","v":"Percent cover of friable bare ground present"},{"$f":"FieldBeeForm!E131","v":5.5E-2},0.3,{"$f":"+D149/E149","v":0.18333333333333335},3,{"$f":"+F149*G149","v":0.55000000000000004},{"$f":"H149/G149","v":0.18333333333333335},null,"70% native bees nest in soil.","Morandin and Winston 2006, Carvell 2004, Potts et al. 2005, Xerces Society for Invertebrate Conservation Society for Invertebrate Conservation 2011"," "]
[null,{"$f":"FieldBeeForm!C134","v":"19 and 20"},{"$f":"FieldBeeForm!D134","v":"Amount of rodent holes and/or bunch grasses"},{"$f":"FieldBeeForm!E134","v":1},2,{"$f":"+D150/E150","v":0.5},2,{"$f":"+F150*G150","v":1},0.5,null,"30% native bees nest in cavities including blue orchard bees.","Thorp et al. 1983, Kearns and Thomson 2001, McFrederick and LeBuhn 2006"]
[null,{"$f":"FieldBeeForm!C138","v":"21, 22 and 23"},{"$f":"FieldBeeForm!D138","v":"Amount of snags/stumps, nest boxes/bundles, pithy tissue"},{"$f":"FieldBeeForm!E138","v":1},2,{"$f":"+D151/E151","v":0.5},2,{"$f":"+F151*G151","v":1},0.5,null,"Bumble bees often nest or overwinter in rodent holes or within bunch grasses.","Bosch and Kemp 2001; Michener 2000; Xerces Society for Invertebrate Conservation Society for Invertebrate Conservation 2011; "]
[null,{"$f":"FieldBeeForm!C139","v":"18 through 23"},{"$f":"FieldBeeForm!D139","v":"Diversity of available nesting materials"},{"$f":"FieldBeeForm!E139","v":0.66666666666666663},1,{"$f":"+D152/E152","v":0.66666666666666663},5,{"$f":"+F152*G152","v":3.333333333333333},0.66666666666666663,null,"A diversity of nesting materials will support a diversity of pollinators.","Tscharntke et al. 1998, Cane 2001, Potts et al. 2005, Westrich 1996"]
[null,null,"Sum of Nesting Materials Weights and Scores",null,null,null,{"$f":"SUM(G149:G152)","v":12},{"$f":"SUM(H149:H152)","v":5.8833333333333329},{"$f":"H153/G153","v":0.49027777777777776},null,"This section of \"Nesting materials\" was weighted as approximately 1/4 of the total Map Unit score."," "]
["Management: Soil disturbance",{"$f":"FieldBeeForm!C140","v":24},"Is the Map Unit tilled at some point during the year? (0 = yes)",{"$f":"IF(FieldBeeForm!E140=0,1,0)","v":0},1,{"$f":"+D154/E154","v":0},1,{"$f":"+F154*G154","v":0},{"$f":"H154/G154","v":0},null,"Soil tilling disturbs ground nesting bees and favors aggressive nonnative plants.","Shuler et al. 2005, NRCS 2009, Xerces Society for Invertebrate Conservation 2011"]
[null,{"$f":"FieldBeeForm!C141","v":25},"Is the Map Unit flood-irrigated at some point during the year? (0 = yes)",{"$f":"IF(FieldBeeForm!E141=0,1,0)","v":1},1,{"$f":"+D155/E155","v":1},1,{"$f":"+F155*G155","v":1},1,null,"Flood irrigation drowns the underground life stages of ground nesting bees.","Vaughn et al. 2007, NRCS 2009, Xerces Society for Invertebrate Conservation 2011"]
[null,{"$f":"FieldBeeForm!C142","v":26},"Is plastic mulching used at the Map Unit? (0 = yes)",{"$f":"IF(FieldBeeForm!E142=0,1,0)","v":0},1,0,1,{"$f":"+F156*G156","v":0},0,null,"Plastic mulching traps the underground life stages of ground nesting bees.","NRCS 2009, Xerces Society for Invertebrate Conservation 2011"]
[null,{"$f":"FieldBeeForm!C143","v":27},"Does road-grading or road-making occur on the Map Unit? (0 = yes)",{"$f":"IF(FieldBeeForm!E143=0,1,0)","v":0},1,0,1,{"$f":"+F157*G157","v":0},0,null,"Road-grading/making distrubs the underground life stages of ground nesting bees.","NRCS 2009, Xerces Society for Invertebrate Conservation 2011"]
[null,{"$f":"FieldBeeForm!C144","v":28},"Total percent cover of map unit that does NOT experience soil disturbance.",{"$f":"1-FieldBeeForm!E144","v":0.4},1,{"$f":"+D158/E158","v":0.4},2,{"$f":"+F158*G158","v":0.8},0.4,null,"The less of the site with ground disturbance, the less the impact to bees.","NRCS 2009, Xerces Society for Invertebrate Conservation 2011"]
[null,null,"Subtotal Sum of Management: Soil Disturbance Weights and Scores",null,null,null,{"$f":"SUM(G154:G158)","v":6},{"$f":"SUM(H154:H158)","v":1.8},{"$f":"H159/G159","v":0.3},null,"This subsection of \"Soil disturbance\" was weighted as 12.5% of the total Map Unit score."]
["Management: Vegetation/ground disturbance",{"$f":"FieldBeeForm!C145","v":29},"Total cover NOT covered by invasive noxious weeds",{"$f":"1-FieldBeeForm!E145","v":1},1,{"$f":"+D160/E160","v":1},1,{"$f":"+F160*G160","v":1},{"$f":"H160/G160","v":1},null,"Aggressive nonnative plant species reduce overall plant diversity, which influences bee diversity.","Williams et al. 2010, NRCS 2009, Bosch and Kemp 2001, Pontin et al. 2006, Holcomb 2009, Pywell et al. 2005"," "]
[null,{"$f":"FieldBeeForm!C146","v":30},"FIVE MINUS the number of invasive noxious weed species",{"$f":"5-FieldBeeForm!E146","v":0},5,{"$f":"+D161/E161","v":0},1,0,0]
[null,{"$f":"FieldBeeForm!C147","v":31},"Percent of the Map Unit NOT burned during the blooming season (Feb through Sept)",{"$f":"1-FieldBeeForm!E147","v":1},1,1,1,1,1,null,"Burning disturbs ground nesting bees and floral resources.","Black et al. 2008, Hartley et al. 2007, Smallidge and Leopold 1997, Manguira and Thomas 1992,  NRCS 2009, Xerces Society for Invertebrate Conservation 2011"]
[null,{"$f":"FieldBeeForm!C148","v":32},"Percent of the Map Unit NOT mowed and/or hayed during the blooming season (Feb through Sept)",{"$f":"1-FieldBeeForm!E148","v":0.9},1,0.9,1,0.9,0.9,null,"Mowing/haying disturbs ground nesting bees and floral resources."]
[null,{"$f":"FieldBeeForm!C149","v":33},"Total percent of the Map Unit NOT burned, mowed, or hayed during the blooming season",{"$f":"1-FieldBeeForm!E149","v":0.7},1,0.7,2,{"$f":"+F164*G164","v":1.4},{"$f":"H164/G164","v":0.7},null,"The less of the site with vegetation/soil disturbance, the less the impact to bees."]
[null,null,"Subtotal Sum of Management: Vegetation/Ground Disturbance Weights and Scores",null,null,null,{"$f":"SUM(G160:G164)","v":6},{"$f":"SUM(H160:H164)","v":4.3},{"$f":"H165/G165","v":0.71666666666666667},null,"This subsection of \"Vegetation/Ground disturbance\" was weighted as 12.5% of the total Map Unit score."]
[null,null,"TOTAL Sum of Management",null,null,null,{"$f":"G159+G165","v":12},{"$f":"H159+H165","v":6.1},{"$f":"H166/G166","v":0.5083333333333333},null,"This section of \"Management\" was weighted as approximately 1/4 of the total Map Unit score."," "]
[null,null,"Map Unit SCORE",null,null,null,{"$f":"(SUM(G140,G148,G153,G166,))","v":48},{"$f":"(SUM(H140,H148,H153,H166,))","v":22.615564738292008},{"$f":"H167/G167","v":0.47115759871441681}]
[null,null,"Map Unit ",{"$f":"D137","v":3},"Combined Score for this Map Unit and Project Area Capacity",null,null,null,{"$f":"0.4*I167+0.6*$I$29","v":0.31274875377148104},{"$f":"I168*H137","v":2.1539170369936711}]
["Combined Acres for Map Units:",{"$f":"H137","v":6.887052341597796},null,null,"Combined Score for all Map Units to this point with the Project Area Capacity",null,null,null,{"$f":"0.4*((I$61*B$63+I$114*B$116+I$167*B$169)/SUM(B$116,B$63, B$169))+0.6*I$29","v":0.30896448392746972},{"$f":"I169*B169","v":2.1278545725032352}]
[]
[]
[]
[]
[]
[]
[]
[]
[]
[]
[]
[]
[]
[]
[]
[]
[]
[]
[]
[]
[{"$f":"+FieldBeeForm!A177","v":4},null,"Map Unit Number:",{"$f":"+FieldBeeForm!A177","v":4},"Map Unit Acres:",null,null,{"$f":"FieldBeeForm!H176","v":0.4591368227731864}]
["Map Unit Characteristics",{"$f":"+FieldBeeForm!C$13","v":"F"},"Acres of Map Unit",{"$f":"+FieldBeeForm!H176","v":0.4591368227731864},{"$f":"+FieldBeeForm!$E$12*0.1","v":10},{"$f":"+D191/E191","v":4.5913682277318638E-2},6,{"$f":"+F191*G191","v":0.27548209366391185},{"$f":"H191/G191","v":4.5913682277318645E-2},null,"The more area of the Map Unit that provides nesting and/or foraging habitat for the pollinators, the better. Credit assigned linearly up to 10% of the total farm area (maximum).","Zurbuchen et al 2008, NRCS 2009"," "]
[null,{"$f":"+FieldBeeForm!C$15","v":"G"},"Percent of Map Unit that is covered with pollinator habitat",{"$f":"+IF(FieldBeeForm!E174<1, 0, IF(FieldBeeForm!E174<10, 1, IF(FieldBeeForm!E174<25, 2, IF(FieldBeeForm!E174<50, 3, IF(FieldBeeForm!E174<75, 4, IF(FieldBeeForm!E174< 85, 5, 6))))))","v":0},6,0,6,0,0,null,"Higher density habitat, vs. diffuse habitat, reduces energy required for pollinators and is therefore also better habitat. Bins set at <1, 1-10, 10-25, 25-50, 50-75, 75-85, >85.","NRCS 2009, Sim and Baltus 1987"," "]
[null,null,"Combined sum of Map Unit extent and density scores",null,null,null,{"$f":"+SUM(G191:G192)","v":12},{"$f":"+SUM(H191:H192)","v":0.27548209366391185},{"$f":"H193/G193","v":2.2956841138659322E-2}]
["Floral resources",{"$f":"FieldBeeForm!C178","v":12},{"$f":"FieldBeeForm!D178","v":"Number of different flowering plant species present during early-blooming (Feb-May) period"},{"$f":"IF(FieldBeeForm!G178>=5, 5, FieldBeeForm!G178)","v":5},5,{"$f":"+D194/E194","v":1},2,{"$f":"+F194*G194","v":2},{"$f":"H194/G194","v":1},null,"Research has shown that it is ideal to have 5 or more flowering plant species present during all seasons (the greater diversity of plants, the greater abundance and diversity of bees).","NRCS 2009, Bosch and Kemp 2001, Pontin et al. 2006, Holcomb 2009, Pywell et al. 2005"]
[null,{"$f":"FieldBeeForm!C179","v":13},{"$f":"FieldBeeForm!D179","v":"Number of different flowering plants present during mid-blooming (Jun-Jul) period"},{"$f":"IF(FieldBeeForm!G179>=5, 5, FieldBeeForm!G179)","v":5},5,1,2,2,1]
[null,{"$f":"FieldBeeForm!C180","v":14},{"$f":"FieldBeeForm!D180","v":"Number of different flowering plants present during late-blooming (Aug-Jan) period"},{"$f":"IF(FieldBeeForm!G180>=5, 5, FieldBeeForm!G180)","v":5},5,1,2,2,1]
[null,{"$f":"FieldBeeForm!C181","v":15},{"$f":"FieldBeeForm!D181","v":"Estimated surface area of flowering plants present during early-blooming (Feb-May) period"},{"$f":"IF(FieldBeeForm!I181=0,0,IF(FieldBeeForm!I181<0.05,1,IF(FieldBeeForm!I181<0.1,2,IF(FieldBeeForm!I181<0.15,3,IF(FieldBeeForm!I181<0.2,4,IF(FieldBeeForm!I181<0.25,5,6))))))","v":0},6,0,1,0,0,null,"Having floral resources available throughout the year supports diversity of pollinator species. Scoring is set at 0, 1 to 5, 5 to 10, 10 to 15, 15 to 20, 20 to 25, and over 25% for maximum score.","Zurbuchen et al 2008, NRCS 2009, Holcomb 2009, Pywell et al. 2005"," "]
[null,{"$f":"FieldBeeForm!C182","v":16},{"$f":"FieldBeeForm!D182","v":"Estimated surface area of flowering plants present during mid-blooming (Jun-Jul) period"},{"$f":"IF(FieldBeeForm!I182=0,0,IF(FieldBeeForm!I182<0.05,1,IF(FieldBeeForm!I182<0.1,2,IF(FieldBeeForm!I182<0.15,3,IF(FieldBeeForm!I182<0.2,4,IF(FieldBeeForm!I182<0.25,5,6))))))","v":0},6,0,1,0,0]
[null,{"$f":"FieldBeeForm!C183","v":17},{"$f":"FieldBeeForm!D183","v":"Estimated surface area of flowering plants present during late-blooming (Aug-Jan) period"},{"$f":"IF(FieldBeeForm!I183=0,0,IF(FieldBeeForm!I183<0.05,1,IF(FieldBeeForm!I183<0.1,2,IF(FieldBeeForm!I183<0.15,3,IF(FieldBeeForm!I183<0.2,4,IF(FieldBeeForm!I183<0.25,5,6))))))","v":0},6,0,1,0,0,null,null,null," "]
[null,null,"Combined coverage of floral resources",{"$f":"+IF(SUM(FieldBeeForm!I181:I183)<0,0, IF(SUM(FieldBeeForm!I181:I183)<0.05, 1, IF(SUM(FieldBeeForm!I181:I183)<0.1, 2, IF(SUM(FieldBeeForm!I181:I183)<0.2, 3, IF(SUM(FieldBeeForm!I181:I183)<0.5, 4, IF(SUM(FieldBeeForm!I181:I183)<0.75, 5, 6))))))","v":1},6,0.16666666666666666,3,0.5,0.16666666666666666]
[null,null,"Sum of Floral Resouces Weights and Scores",null,null,null,{"$f":"SUM(G194:G200)","v":12},{"$f":"SUM(H194:H200)","v":6.5},{"$f":"H201/G201","v":0.54166666666666663},null,"This section of \"Floral Resources\" was weighted as approximately 1/4 of the total Map Unit score."," "]
["Nesting materials",{"$f":"FieldBeeForm!C184","v":18},{"$f":"FieldBeeForm!D184","v":"Percent cover of friable bare ground present"},{"$f":"FieldBeeForm!E184","v":5.5E-2},0.3,{"$f":"+D202/E202","v":0.18333333333333335},3,{"$f":"+F202*G202","v":0.55000000000000004},{"$f":"H202/G202","v":0.18333333333333335},null,"70% native bees nest in soil.","Morandin and Winston 2006, Carvell 2004, Potts et al. 2005, Xerces Society for Invertebrate Conservation Society for Invertebrate Conservation 2011"," "]
[null,{"$f":"FieldBeeForm!C187","v":"19 and 20"},{"$f":"FieldBeeForm!D187","v":"Amount of rodent holes and/or bunch grasses"},{"$f":"FieldBeeForm!E187","v":1},2,{"$f":"+D203/E203","v":0.5},2,{"$f":"+F203*G203","v":1},0.5,null,"30% native bees nest in cavities including blue orchard bees.","Thorp et al. 1983, Kearns and Thomson 2001, McFrederick and LeBuhn 2006"]
[null,{"$f":"FieldBeeForm!C191","v":"21, 22 and 23"},{"$f":"FieldBeeForm!D191","v":"Amount of snags/stumps, nest boxes/bundles, pithy tissue"},{"$f":"FieldBeeForm!E191","v":1},2,{"$f":"+D204/E204","v":0.5},2,{"$f":"+F204*G204","v":1},0.5,null,"Bumble bees often nest or overwinter in rodent holes or within bunch grasses.","Bosch and Kemp 2001; Michener 2000; Xerces Society for Invertebrate Conservation Society for Invertebrate Conservation 2011; "]
[null,{"$f":"FieldBeeForm!C192","v":"18 through 23"},{"$f":"FieldBeeForm!D192","v":"Diversity of available nesting materials"},{"$f":"FieldBeeForm!E192","v":0.66666666666666663},1,{"$f":"+D205/E205","v":0.66666666666666663},5,{"$f":"+F205*G205","v":3.333333333333333},0.66666666666666663,null,"A diversity of nesting materials will support a diversity of pollinators.","Tscharntke et al. 1998, Cane 2001, Potts et al. 2005, Westrich 1996"]
[null,null,"Sum of Nesting Materials Weights and Scores",null,null,null,{"$f":"SUM(G202:G205)","v":12},{"$f":"SUM(H202:H205)","v":5.8833333333333329},{"$f":"H206/G206","v":0.49027777777777776},null,"This section of \"Nesting materials\" was weighted as approximately 1/4 of the total Map Unit score."," "]
["Management: Soil disturbance",{"$f":"FieldBeeForm!C193","v":24},"Is the Map Unit tilled at some point during the year? (0 = yes)",{"$f":"IF(FieldBeeForm!E193=0,1,0)","v":0},1,{"$f":"+D207/E207","v":0},1,{"$f":"+F207*G207","v":0},{"$f":"H207/G207","v":0},null,"Soil tilling disturbs ground nesting bees and favors aggressive nonnative plants.","Shuler et al. 2005, NRCS 2009, Xerces Society for Invertebrate Conservation 2011"]
[null,{"$f":"FieldBeeForm!C194","v":25},"Is the Map Unit flood-irrigated at some point during the year? (0 = yes)",{"$f":"IF(FieldBeeForm!E194=0,1,0)","v":1},1,{"$f":"+D208/E208","v":1},1,{"$f":"+F208*G208","v":1},1,null,"Flood irrigation drowns the underground life stages of ground nesting bees.","Vaughn et al. 2007, NRCS 2009, Xerces Society for Invertebrate Conservation 2011"]
[null,{"$f":"FieldBeeForm!C195","v":26},"Is plastic mulching used at the Map Unit? (0 = yes)",{"$f":"IF(FieldBeeForm!E195=0,1,0)","v":0},1,0,1,{"$f":"+F209*G209","v":0},0,null,"Plastic mulching traps the underground life stages of ground nesting bees.","NRCS 2009, Xerces Society for Invertebrate Conservation 2011"]
[null,{"$f":"FieldBeeForm!C196","v":27},"Does road-grading or road-making occur on the Map Unit? (0 = yes)",{"$f":"IF(FieldBeeForm!E196=0,1,0)","v":0},1,0,1,{"$f":"+F210*G210","v":0},0,null,"Road-grading/making distrubs the underground life stages of ground nesting bees.","NRCS 2009, Xerces Society for Invertebrate Conservation 2011"]
[null,{"$f":"FieldBeeForm!C197","v":28},"Total percent cover of map unit that does NOT experience soil disturbance.",{"$f":"1-FieldBeeForm!E197","v":0.4},1,{"$f":"+D211/E211","v":0.4},2,{"$f":"+F211*G211","v":0.8},0.4,null,"The less of the site with ground disturbance, the less the impact to bees.","NRCS 2009, Xerces Society for Invertebrate Conservation 2011"]
[null,null,"Subtotal Sum of Management: Soil Disturbance Weights and Scores",null,null,null,{"$f":"SUM(G207:G211)","v":6},{"$f":"SUM(H207:H211)","v":1.8},{"$f":"H212/G212","v":0.3},null,"This subsection of \"Soil disturbance\" was weighted as 12.5% of the total Map Unit score."]
["Management: Vegetation/ground disturbance",{"$f":"FieldBeeForm!C198","v":29},"Total cover NOT covered by invasive noxious weeds",{"$f":"1-FieldBeeForm!E198","v":1},1,{"$f":"+D213/E213","v":1},1,{"$f":"+F213*G213","v":1},{"$f":"H213/G213","v":1},null,"Aggressive nonnative plant species reduce overall plant diversity, which influences bee diversity.","Williams et al. 2010, NRCS 2009, Bosch and Kemp 2001, Pontin et al. 2006, Holcomb 2009, Pywell et al. 2005"," "]
[null,{"$f":"FieldBeeForm!C199","v":30},"FIVE MINUS the number of invasive noxious weed species",{"$f":"5-FieldBeeForm!E199","v":0},5,{"$f":"+D214/E214","v":0},1,0,0]
[null,{"$f":"FieldBeeForm!C200","v":31},"Percent of the Map Unit NOT burned during the blooming season (Feb through Sept)",{"$f":"1-FieldBeeForm!E200","v":1},1,1,1,1,1,null,"Burning disturbs ground nesting bees and floral resources.","Black et al. 2008, Hartley et al. 2007, Smallidge and Leopold 1997, Manguira and Thomas 1992,  NRCS 2009, Xerces Society for Invertebrate Conservation 2011"]
[null,{"$f":"FieldBeeForm!C201","v":32},"Percent of the Map Unit NOT mowed and/or hayed during the blooming season (Feb through Sept)",{"$f":"1-FieldBeeForm!E201","v":0.9},1,0.9,1,0.9,0.9,null,"Mowing/haying disturbs ground nesting bees and floral resources."]
[null,{"$f":"FieldBeeForm!C202","v":33},"Total percent of the Map Unit NOT burned, mowed, or hayed during the blooming season",{"$f":"1-FieldBeeForm!E202","v":0.7},1,0.7,2,{"$f":"+F217*G217","v":1.4},{"$f":"H217/G217","v":0.7},null,"The less of the site with vegetation/soil disturbance, the less the impact to bees."]
[null,null,"Subtotal Sum of Management: Vegetation/Ground Disturbance Weights and Scores",null,null,null,{"$f":"SUM(G213:G217)","v":6},{"$f":"SUM(H213:H217)","v":4.3},{"$f":"H218/G218","v":0.71666666666666667},null,"This subsection of \"Vegetation/Ground disturbance\" was weighted as 12.5% of the total Map Unit score."]
[null,null,"TOTAL Sum of Management",null,null,null,{"$f":"G212+G218","v":12},{"$f":"H212+H218","v":6.1},{"$f":"H219/G219","v":0.5083333333333333},null,"This section of \"Management\" was weighted as approximately 1/4 of the total Map Unit score."," "]
[null,null,"Map Unit SCORE",null,null,null,{"$f":"(SUM(G193,G201,G206,G219,))","v":48},{"$f":"(SUM(H193,H201,H206,H219,))","v":18.758815426997245},{"$f":"H220/G220","v":0.39080865472910925}]
[null,null,"Map Unit ",{"$f":"D190","v":4},"Combined Score for this Map Unit and Project Area Capacity",null,null,null,{"$f":"0.4*I220+0.6*$I$29","v":0.28060917617735798},{"$f":"I221*H190","v":0.12883800559107345}]
["Combined Acres for Map Units:",{"$f":"H190","v":0.4591368227731864},null,null,"Combined Score for all Map Units to this point with the Project Area Capacity",null,null,null,{"$f":"0.4*((I$61*B$63+I$114*B$116+I$167*B$169+I$220*B$222)/SUM(B$116,B$63, B$169,B$222))+0.6*I$29","v":0.30748452318997077},{"$f":"I222*B222","v":0.14117746702937134}]
[]
[]
[]
[]
[]
[]
[]
[]
[]
[]
[]
[]
[]
[]
[]
[]
[]
[]
[]
[]
[{"$f":"+FieldBeeForm!A230","v":5},null,"Map Unit Number:",{"$f":"+FieldBeeForm!A230","v":5},"Map Unit Acres:",null,null,{"$f":"FieldBeeForm!H229","v":0.4591368227731864}]
["Map Unit Characteristics",{"$f":"+FieldBeeForm!C$13","v":"F"},"Acres of Map Unit",{"$f":"+FieldBeeForm!H229","v":0.4591368227731864},{"$f":"+FieldBeeForm!$E$12*0.1","v":10},{"$f":"+D244/E244","v":4.5913682277318638E-2},6,{"$f":"+F244*G244","v":0.27548209366391185},{"$f":"H244/G244","v":4.5913682277318645E-2},null,"The more area of the Map Unit that provides nesting and/or foraging habitat for the pollinators, the better. Credit assigned linearly up to 10% of the total farm area (maximum).","Zurbuchen et al 2008, NRCS 2009"," "]
[null,{"$f":"+FieldBeeForm!C$15","v":"G"},"Percent of Map Unit that is covered with pollinator habitat",{"$f":"+IF(FieldBeeForm!E227<1, 0, IF(FieldBeeForm!E227<10, 1, IF(FieldBeeForm!E227<25, 2, IF(FieldBeeForm!E227<50, 3, IF(FieldBeeForm!E227<75, 4, IF(FieldBeeForm!E227< 85, 5, 6))))))","v":0},6,0,6,0,0,null,"Higher density habitat, vs. diffuse habitat, reduces energy required for pollinators and is therefore also better habitat. Bins set at <1, 1-10, 10-25, 25-50, 50-75, 75-85, >85.","NRCS 2009, Sim and Baltus 1987"," "]
[null,null,"Combined sum of Map Unit extent and density scores",null,null,null,{"$f":"+SUM(G244:G245)","v":12},{"$f":"+SUM(H244:H245)","v":0.27548209366391185},{"$f":"H246/G246","v":2.2956841138659322E-2}]
["Floral resources",{"$f":"FieldBeeForm!C231","v":12},{"$f":"FieldBeeForm!D231","v":"Number of different flowering plant species present during early-blooming (Feb-May) period"},{"$f":"IF(FieldBeeForm!G231>=5, 5, FieldBeeForm!G231)","v":5},5,{"$f":"+D247/E247","v":1},2,{"$f":"+F247*G247","v":2},{"$f":"H247/G247","v":1},null,"Research has shown that it is ideal to have 5 or more flowering plant species present during all seasons (the greater diversity of plants, the greater abundance and diversity of bees).","NRCS 2009, Bosch and Kemp 2001, Pontin et al. 2006, Holcomb 2009, Pywell et al. 2005"]
[null,{"$f":"FieldBeeForm!C232","v":13},{"$f":"FieldBeeForm!D232","v":"Number of different flowering plants present during mid-blooming (Jun-Jul) period"},{"$f":"IF(FieldBeeForm!G232>=5, 5, FieldBeeForm!G232)","v":5},5,1,2,2,1]
[null,{"$f":"FieldBeeForm!C233","v":14},{"$f":"FieldBeeForm!D233","v":"Number of different flowering plants present during late-blooming (Aug-Jan) period"},{"$f":"IF(FieldBeeForm!G233>=5, 5, FieldBeeForm!G233)","v":5},5,1,2,2,1]
[null,{"$f":"FieldBeeForm!C234","v":15},{"$f":"FieldBeeForm!D234","v":"Estimated surface area of flowering plants present during early-blooming (Feb-May) period"},{"$f":"IF(FieldBeeForm!I234=0,0,IF(FieldBeeForm!I234<0.05,1,IF(FieldBeeForm!I234<0.1,2,IF(FieldBeeForm!I234<0.15,3,IF(FieldBeeForm!I234<0.2,4,IF(FieldBeeForm!I234<0.25,5,6))))))","v":0},6,0,1,0,0,null,"Having floral resources available throughout the year supports diversity of pollinator species. Scoring is set at 0, 1 to 5, 5 to 10, 10 to 15, 15 to 20, 20 to 25, and over 25% for maximum score.","Zurbuchen et al 2008, NRCS 2009, Holcomb 2009, Pywell et al. 2005"," "]
[null,{"$f":"FieldBeeForm!C235","v":16},{"$f":"FieldBeeForm!D235","v":"Estimated surface area of flowering plants present during mid-blooming (Jun-Jul) period"},{"$f":"IF(FieldBeeForm!I235=0,0,IF(FieldBeeForm!I235<0.05,1,IF(FieldBeeForm!I235<0.1,2,IF(FieldBeeForm!I235<0.15,3,IF(FieldBeeForm!I235<0.2,4,IF(FieldBeeForm!I235<0.25,5,6))))))","v":0},6,0,1,0,0]
[null,{"$f":"FieldBeeForm!C236","v":17},{"$f":"FieldBeeForm!D236","v":"Estimated surface area of flowering plants present during late-blooming (Aug-Jan) period"},{"$f":"IF(FieldBeeForm!I236=0,0,IF(FieldBeeForm!I236<0.05,1,IF(FieldBeeForm!I236<0.1,2,IF(FieldBeeForm!I236<0.15,3,IF(FieldBeeForm!I236<0.2,4,IF(FieldBeeForm!I236<0.25,5,6))))))","v":0},6,0,1,0,0,null,null,null," "]
[null,null,"Combined coverage of floral resources",{"$f":"+IF(SUM(FieldBeeForm!I234:I236)<0,0, IF(SUM(FieldBeeForm!I234:I236)<0.05, 1, IF(SUM(FieldBeeForm!I234:I236)<0.1, 2, IF(SUM(FieldBeeForm!I234:I236)<0.2, 3, IF(SUM(FieldBeeForm!I234:I236)<0.5, 4, IF(SUM(FieldBeeForm!I234:I236)<0.75, 5, 6))))))","v":1},6,0.16666666666666666,3,0.5,0.16666666666666666]
[null,null,"Sum of Floral Resouces Weights and Scores",null,null,null,{"$f":"SUM(G247:G253)","v":12},{"$f":"SUM(H247:H253)","v":6.5},{"$f":"H254/G254","v":0.54166666666666663},null,"This section of \"Floral Resources\" was weighted as approximately 1/4 of the total Map Unit score."," "]
["Nesting materials",{"$f":"FieldBeeForm!C237","v":18},{"$f":"FieldBeeForm!D237","v":"Percent cover of friable bare ground present"},{"$f":"FieldBeeForm!E237","v":5.5E-2},0.3,{"$f":"+D255/E255","v":0.18333333333333335},3,{"$f":"+F255*G255","v":0.55000000000000004},{"$f":"H255/G255","v":0.18333333333333335},null,"70% native bees nest in soil.","Morandin and Winston 2006, Carvell 2004, Potts et al. 2005, Xerces Society for Invertebrate Conservation Society for Invertebrate Conservation 2011"," "]
[null,{"$f":"FieldBeeForm!C240","v":"19 and 20"},{"$f":"FieldBeeForm!D240","v":"Amount of rodent holes and/or bunch grasses"},{"$f":"FieldBeeForm!E240","v":1},2,{"$f":"+D256/E256","v":0.5},2,{"$f":"+F256*G256","v":1},0.5,null,"30% native bees nest in cavities including blue orchard bees.","Thorp et al. 1983, Kearns and Thomson 2001, McFrederick and LeBuhn 2006"]
[null,{"$f":"FieldBeeForm!C244","v":"21, 22 and 23"},{"$f":"FieldBeeForm!D244","v":"Amount of snags/stumps, nest boxes/bundles, pithy tissue"},{"$f":"FieldBeeForm!E244","v":1},2,{"$f":"+D257/E257","v":0.5},2,{"$f":"+F257*G257","v":1},0.5,null,"Bumble bees often nest or overwinter in rodent holes or within bunch grasses.","Bosch and Kemp 2001; Michener 2000; Xerces Society for Invertebrate Conservation Society for Invertebrate Conservation 2011; "]
[null,{"$f":"FieldBeeForm!C245","v":"18 through 23"},{"$f":"FieldBeeForm!D245","v":"Diversity of available nesting materials"},{"$f":"FieldBeeForm!E245","v":0.66666666666666663},1,{"$f":"+D258/E258","v":0.66666666666666663},5,{"$f":"+F258*G258","v":3.333333333333333},0.66666666666666663,null,"A diversity of nesting materials will support a diversity of pollinators.","Tscharntke et al. 1998, Cane 2001, Potts et al. 2005, Westrich 1996"]
[null,null,"Sum of Nesting Materials Weights and Scores",null,null,null,{"$f":"SUM(G255:G258)","v":12},{"$f":"SUM(H255:H258)","v":5.8833333333333329},{"$f":"H259/G259","v":0.49027777777777776},null,"This section of \"Nesting materials\" was weighted as approximately 1/4 of the total Map Unit score."," "]
["Management: Soil disturbance",{"$f":"FieldBeeForm!C246","v":24},"Is the Map Unit tilled at some point during the year? (0 = yes)",{"$f":"IF(FieldBeeForm!E246=0,1,0)","v":0},1,{"$f":"+D260/E260","v":0},1,{"$f":"+F260*G260","v":0},{"$f":"H260/G260","v":0},null,"Soil tilling disturbs ground nesting bees and favors aggressive nonnative plants.","Shuler et al. 2005, NRCS 2009, Xerces Society for Invertebrate Conservation 2011"]
[null,{"$f":"FieldBeeForm!C247","v":25},"Is the Map Unit flood-irrigated at some point during the year? (0 = yes)",{"$f":"IF(FieldBeeForm!E247=0,1,0)","v":1},1,{"$f":"+D261/E261","v":1},1,{"$f":"+F261*G261","v":1},1,null,"Flood irrigation drowns the underground life stages of ground nesting bees.","Vaughn et al. 2007, NRCS 2009, Xerces Society for Invertebrate Conservation 2011"]
[null,{"$f":"FieldBeeForm!C248","v":26},"Is plastic mulching used at the Map Unit? (0 = yes)",{"$f":"IF(FieldBeeForm!E248=0,1,0)","v":0},1,0,1,{"$f":"+F262*G262","v":0},0,null,"Plastic mulching traps the underground life stages of ground nesting bees.","NRCS 2009, Xerces Society for Invertebrate Conservation 2011"]
[null,{"$f":"FieldBeeForm!C249","v":27},"Does road-grading or road-making occur on the Map Unit? (0 = yes)",{"$f":"IF(FieldBeeForm!E249=0,1,0)","v":0},1,0,1,{"$f":"+F263*G263","v":0},0,null,"Road-grading/making distrubs the underground life stages of ground nesting bees.","NRCS 2009, Xerces Society for Invertebrate Conservation 2011"]
[null,{"$f":"FieldBeeForm!C250","v":28},"Total percent cover of map unit that does NOT experience soil disturbance.",{"$f":"1-FieldBeeForm!E250","v":0.4},1,{"$f":"+D264/E264","v":0.4},2,{"$f":"+F264*G264","v":0.8},0.4,null,"The less of the site with ground disturbance, the less the impact to bees.","NRCS 2009, Xerces Society for Invertebrate Conservation 2011"]
[null,null,"Subtotal Sum of Management: Soil Disturbance Weights and Scores",null,null,null,{"$f":"SUM(G260:G264)","v":6},{"$f":"SUM(H260:H264)","v":1.8},{"$f":"H265/G265","v":0.3},null,"This subsection of \"Soil disturbance\" was weighted as 12.5% of the total Map Unit score."]
["Management: Vegetation/ground disturbance",{"$f":"FieldBeeForm!C251","v":29},"Total cover NOT covered by invasive noxious weeds",{"$f":"1-FieldBeeForm!E251","v":1},1,{"$f":"+D266/E266","v":1},1,{"$f":"+F266*G266","v":1},{"$f":"H266/G266","v":1},null,"Aggressive nonnative plant species reduce overall plant diversity, which influences bee diversity.","Williams et al. 2010, NRCS 2009, Bosch and Kemp 2001, Pontin et al. 2006, Holcomb 2009, Pywell et al. 2005"," "]
[null,{"$f":"FieldBeeForm!C252","v":30},"FIVE MINUS the number of invasive noxious weed species",{"$f":"5-FieldBeeForm!E252","v":0},5,{"$f":"+D267/E267","v":0},1,0,0]
[null,{"$f":"FieldBeeForm!C253","v":31},"Percent of the Map Unit NOT burned during the blooming season (Feb through Sept)",{"$f":"1-FieldBeeForm!E253","v":1},1,1,1,1,1,null,"Burning disturbs ground nesting bees and floral resources.","Black et al. 2008, Hartley et al. 2007, Smallidge and Leopold 1997, Manguira and Thomas 1992,  NRCS 2009, Xerces Society for Invertebrate Conservation 2011"]
[null,{"$f":"FieldBeeForm!C254","v":32},"Percent of the Map Unit NOT mowed and/or hayed during the blooming season (Feb through Sept)",{"$f":"1-FieldBeeForm!E254","v":0.9},1,0.9,1,0.9,0.9,null,"Mowing/haying disturbs ground nesting bees and floral resources."]
[null,{"$f":"FieldBeeForm!C255","v":33},"Total percent of the Map Unit NOT burned, mowed, or hayed during the blooming season",{"$f":"1-FieldBeeForm!E255","v":0.7},1,0.7,2,{"$f":"+F270*G270","v":1.4},{"$f":"H270/G270","v":0.7},null,"The less of the site with vegetation/soil disturbance, the less the impact to bees."]
[null,null,"Subtotal Sum of Management: Vegetation/Ground Disturbance Weights and Scores",null,null,null,{"$f":"SUM(G266:G270)","v":6},{"$f":"SUM(H266:H270)","v":4.3},{"$f":"H271/G271","v":0.71666666666666667},null,"This subsection of \"Vegetation/Ground disturbance\" was weighted as 12.5% of the total Map Unit score."]
[null,null,"TOTAL Sum of Management",null,null,null,{"$f":"G265+G271","v":12},{"$f":"H265+H271","v":6.1},{"$f":"H272/G272","v":0.5083333333333333},null,"This section of \"Management\" was weighted as approximately 1/4 of the total Map Unit score."," "]
[null,null,"Map Unit SCORE",null,null,null,{"$f":"(SUM(G246,G254,G259,G272,))","v":48},{"$f":"(SUM(H246,H254,H259,H272,))","v":18.758815426997245},{"$f":"H273/G273","v":0.39080865472910925}]
[null,null,"Map Unit ",{"$f":"D243","v":5},"Combined Score for this Map Unit and Project Area Capacity",null,null,null,{"$f":"0.4*I273+0.6*$I$29","v":0.28060917617735798},{"$f":"I274*H243","v":0.12883800559107345}]
["Combined Acres for Map Units:",{"$f":"H243","v":0.4591368227731864},null,null,"Combined Score for all Map Units to this point with the Project Area Capacity",null,null,null,{"$f":"0.4*((I$61*B$63+I$114*B$116+I$167*B$169+I$220*B$222+I$273*B$275)/SUM(B$116,B$63, B$169,B$222, B$275))+0.6*I$29","v":0.30615138759570443},{"$f":"I275*B275","v":0.14056537538829403}]
[]
[]
[]
[]
[]
[]
[]
[]
[]
[]
[]
[]
[]
[]
[]
[]
[]
[]
[]
[]
[{"$f":"+FieldBeeForm!A283","v":6},null,"Map Unit Number:",{"$f":"+FieldBeeForm!A283","v":6},"Map Unit Acres:",null,null,{"$f":"FieldBeeForm!H282","v":0.4591368227731864}]
["Map Unit Characteristics",{"$f":"+FieldBeeForm!C$13","v":"F"},"Acres of Map Unit",{"$f":"+FieldBeeForm!H282","v":0.4591368227731864},{"$f":"+FieldBeeForm!$E$12*0.1","v":10},{"$f":"+D297/E297","v":4.5913682277318638E-2},6,{"$f":"+F297*G297","v":0.27548209366391185},{"$f":"H297/G297","v":4.5913682277318645E-2},null,"The more area of the Map Unit that provides nesting and/or foraging habitat for the pollinators, the better. Credit assigned linearly up to 10% of the total farm area (maximum).","Zurbuchen et al 2008, NRCS 2009"," "]
[null,{"$f":"+FieldBeeForm!C$15","v":"G"},"Percent of Map Unit that is covered with pollinator habitat",{"$f":"+IF(FieldBeeForm!E280<1, 0, IF(FieldBeeForm!E280<10, 1, IF(FieldBeeForm!E280<25, 2, IF(FieldBeeForm!E280<50, 3, IF(FieldBeeForm!E280<75, 4, IF(FieldBeeForm!E280< 85, 5, 6))))))","v":0},6,0,6,0,0,null,"Higher density habitat, vs. diffuse habitat, reduces energy required for pollinators and is therefore also better habitat. Bins set at <1, 1-10, 10-25, 25-50, 50-75, 75-85, >85.","NRCS 2009, Sim and Baltus 1987"," "]
[null,null,"Combined sum of Map Unit extent and density scores",null,null,null,{"$f":"+SUM(G297:G298)","v":12},{"$f":"+SUM(H297:H298)","v":0.27548209366391185},{"$f":"H299/G299","v":2.2956841138659322E-2}]
["Floral resources",{"$f":"FieldBeeForm!C284","v":12},{"$f":"FieldBeeForm!D284","v":"Number of different flowering plant species present during early-blooming (Feb-May) period"},{"$f":"IF(FieldBeeForm!G284>=5, 5, FieldBeeForm!G284)","v":5},5,{"$f":"+D300/E300","v":1},2,{"$f":"+F300*G300","v":2},{"$f":"H300/G300","v":1},null,"Research has shown that it is ideal to have 5 or more flowering plant species present during all seasons (the greater diversity of plants, the greater abundance and diversity of bees).","NRCS 2009, Bosch and Kemp 2001, Pontin et al. 2006, Holcomb 2009, Pywell et al. 2005"]
[null,{"$f":"FieldBeeForm!C285","v":13},{"$f":"FieldBeeForm!D285","v":"Number of different flowering plants present during mid-blooming (Jun-Jul) period"},{"$f":"IF(FieldBeeForm!G285>=5, 5, FieldBeeForm!G285)","v":5},5,1,2,2,1]
[null,{"$f":"FieldBeeForm!C286","v":14},{"$f":"FieldBeeForm!D286","v":"Number of different flowering plants present during late-blooming (Aug-Jan) period"},{"$f":"IF(FieldBeeForm!G286>=5, 5, FieldBeeForm!G286)","v":5},5,1,2,2,1]
[null,{"$f":"FieldBeeForm!C287","v":15},{"$f":"FieldBeeForm!D287","v":"Estimated surface area of flowering plants present during early-blooming (Feb-May) period"},{"$f":"IF(FieldBeeForm!I287=0,0,IF(FieldBeeForm!I287<0.05,1,IF(FieldBeeForm!I287<0.1,2,IF(FieldBeeForm!I287<0.15,3,IF(FieldBeeForm!I287<0.2,4,IF(FieldBeeForm!I287<0.25,5,6))))))","v":0},6,0,1,0,0,null,"Having floral resources available throughout the year supports diversity of pollinator species. Scoring is set at 0, 1 to 5, 5 to 10, 10 to 15, 15 to 20, 20 to 25, and over 25% for maximum score.","Zurbuchen et al 2008, NRCS 2009, Holcomb 2009, Pywell et al. 2005"," "]
[null,{"$f":"FieldBeeForm!C288","v":16},{"$f":"FieldBeeForm!D288","v":"Estimated surface area of flowering plants present during mid-blooming (Jun-Jul) period"},{"$f":"IF(FieldBeeForm!I288=0,0,IF(FieldBeeForm!I288<0.05,1,IF(FieldBeeForm!I288<0.1,2,IF(FieldBeeForm!I288<0.15,3,IF(FieldBeeForm!I288<0.2,4,IF(FieldBeeForm!I288<0.25,5,6))))))","v":0},6,0,1,0,0]
[null,{"$f":"FieldBeeForm!C289","v":17},{"$f":"FieldBeeForm!D289","v":"Estimated surface area of flowering plants present during late-blooming (Aug-Jan) period"},{"$f":"IF(FieldBeeForm!I289=0,0,IF(FieldBeeForm!I289<0.05,1,IF(FieldBeeForm!I289<0.1,2,IF(FieldBeeForm!I289<0.15,3,IF(FieldBeeForm!I289<0.2,4,IF(FieldBeeForm!I289<0.25,5,6))))))","v":0},6,0,1,0,0,null,null,null," "]
[null,null,"Combined coverage of floral resources",{"$f":"+IF(SUM(FieldBeeForm!I287:I289)<0,0, IF(SUM(FieldBeeForm!I287:I289)<0.05, 1, IF(SUM(FieldBeeForm!I287:I289)<0.1, 2, IF(SUM(FieldBeeForm!I287:I289)<0.2, 3, IF(SUM(FieldBeeForm!I287:I289)<0.5, 4, IF(SUM(FieldBeeForm!I287:I289)<0.75, 5, 6))))))","v":1},6,0.16666666666666666,3,0.5,0.16666666666666666]
[null,null,"Sum of Floral Resouces Weights and Scores",null,null,null,{"$f":"SUM(G300:G306)","v":12},{"$f":"SUM(H300:H306)","v":6.5},{"$f":"H307/G307","v":0.54166666666666663},null,"This section of \"Floral Resources\" was weighted as approximately 1/4 of the total Map Unit score."," "]
["Nesting materials",{"$f":"FieldBeeForm!C290","v":18},{"$f":"FieldBeeForm!D290","v":"Percent cover of friable bare ground present"},{"$f":"FieldBeeForm!E290","v":5.5E-2},0.3,{"$f":"+D308/E308","v":0.18333333333333335},3,{"$f":"+F308*G308","v":0.55000000000000004},{"$f":"H308/G308","v":0.18333333333333335},null,"70% native bees nest in soil.","Morandin and Winston 2006, Carvell 2004, Potts et al. 2005, Xerces Society for Invertebrate Conservation Society for Invertebrate Conservation 2011"," "]
[null,{"$f":"FieldBeeForm!C293","v":"19 and 20"},{"$f":"FieldBeeForm!D293","v":"Amount of rodent holes and/or bunch grasses"},{"$f":"FieldBeeForm!E293","v":1},2,{"$f":"+D309/E309","v":0.5},2,{"$f":"+F309*G309","v":1},0.5,null,"30% native bees nest in cavities including blue orchard bees.","Thorp et al. 1983, Kearns and Thomson 2001, McFrederick and LeBuhn 2006"]
[null,{"$f":"FieldBeeForm!C297","v":"21, 22 and 23"},{"$f":"FieldBeeForm!D297","v":"Amount of snags/stumps, nest boxes/bundles, pithy tissue"},{"$f":"FieldBeeForm!E297","v":1},2,{"$f":"+D310/E310","v":0.5},2,{"$f":"+F310*G310","v":1},0.5,null,"Bumble bees often nest or overwinter in rodent holes or within bunch grasses.","Bosch and Kemp 2001; Michener 2000; Xerces Society for Invertebrate Conservation Society for Invertebrate Conservation 2011; "]
[null,{"$f":"FieldBeeForm!C298","v":"18 through 23"},{"$f":"FieldBeeForm!D298","v":"Diversity of available nesting materials"},{"$f":"FieldBeeForm!E298","v":0.66666666666666663},1,{"$f":"+D311/E311","v":0.66666666666666663},5,{"$f":"+F311*G311","v":3.333333333333333},0.66666666666666663,null,"A diversity of nesting materials will support a diversity of pollinators.","Tscharntke et al. 1998, Cane 2001, Potts et al. 2005, Westrich 1996"]
[null,null,"Sum of Nesting Materials Weights and Scores",null,null,null,{"$f":"SUM(G308:G311)","v":12},{"$f":"SUM(H308:H311)","v":5.8833333333333329},{"$f":"H312/G312","v":0.49027777777777776},null,"This section of \"Nesting materials\" was weighted as approximately 1/4 of the total Map Unit score."," "]
["Management: Soil disturbance",{"$f":"FieldBeeForm!C299","v":24},"Is the Map Unit tilled at some point during the year? (0 = yes)",{"$f":"IF(FieldBeeForm!E299=0,1,0)","v":0},1,{"$f":"+D313/E313","v":0},1,{"$f":"+F313*G313","v":0},{"$f":"H313/G313","v":0},null,"Soil tilling disturbs ground nesting bees and favors aggressive nonnative plants.","Shuler et al. 2005, NRCS 2009, Xerces Society for Invertebrate Conservation 2011"]
[null,{"$f":"FieldBeeForm!C300","v":25},"Is the Map Unit flood-irrigated at some point during the year? (0 = yes)",{"$f":"IF(FieldBeeForm!E300=0,1,0)","v":1},1,{"$f":"+D314/E314","v":1},1,{"$f":"+F314*G314","v":1},1,null,"Flood irrigation drowns the underground life stages of ground nesting bees.","Vaughn et al. 2007, NRCS 2009, Xerces Society for Invertebrate Conservation 2011"]
[null,{"$f":"FieldBeeForm!C301","v":26},"Is plastic mulching used at the Map Unit? (0 = yes)",{"$f":"IF(FieldBeeForm!E301=0,1,0)","v":0},1,0,1,{"$f":"+F315*G315","v":0},0,null,"Plastic mulching traps the underground life stages of ground nesting bees.","NRCS 2009, Xerces Society for Invertebrate Conservation 2011"]
[null,{"$f":"FieldBeeForm!C302","v":27},"Does road-grading or road-making occur on the Map Unit? (0 = yes)",{"$f":"IF(FieldBeeForm!E302=0,1,0)","v":0},1,0,1,{"$f":"+F316*G316","v":0},0,null,"Road-grading/making distrubs the underground life stages of ground nesting bees.","NRCS 2009, Xerces Society for Invertebrate Conservation 2011"]
[null,{"$f":"FieldBeeForm!C303","v":28},"Total percent cover of map unit that does NOT experience soil disturbance.",{"$f":"1-FieldBeeForm!E303","v":0.4},1,{"$f":"+D317/E317","v":0.4},2,{"$f":"+F317*G317","v":0.8},0.4,null,"The less of the site with ground disturbance, the less the impact to bees.","NRCS 2009, Xerces Society for Invertebrate Conservation 2011"]
[null,null,"Subtotal Sum of Management: Soil Disturbance Weights and Scores",null,null,null,{"$f":"SUM(G313:G317)","v":6},{"$f":"SUM(H313:H317)","v":1.8},{"$f":"H318/G318","v":0.3},null,"This subsection of \"Soil disturbance\" was weighted as 12.5% of the total Map Unit score."]
["Management: Vegetation/ground disturbance",{"$f":"FieldBeeForm!C304","v":29},"Total cover NOT covered by invasive noxious weeds",{"$f":"1-FieldBeeForm!E304","v":1},1,{"$f":"+D319/E319","v":1},1,{"$f":"+F319*G319","v":1},{"$f":"H319/G319","v":1},null,"Aggressive nonnative plant species reduce overall plant diversity, which influences bee diversity.","Williams et al. 2010, NRCS 2009, Bosch and Kemp 2001, Pontin et al. 2006, Holcomb 2009, Pywell et al. 2005"," "]
[null,{"$f":"FieldBeeForm!C305","v":30},"FIVE MINUS the number of invasive noxious weed species",{"$f":"5-FieldBeeForm!E305","v":0},5,{"$f":"+D320/E320","v":0},1,0,0]
[null,{"$f":"FieldBeeForm!C306","v":31},"Percent of the Map Unit NOT burned during the blooming season (Feb through Sept)",{"$f":"1-FieldBeeForm!E306","v":1},1,1,1,1,1,null,"Burning disturbs ground nesting bees and floral resources.","Black et al. 2008, Hartley et al. 2007, Smallidge and Leopold 1997, Manguira and Thomas 1992,  NRCS 2009, Xerces Society for Invertebrate Conservation 2011"]
[null,{"$f":"FieldBeeForm!C307","v":32},"Percent of the Map Unit NOT mowed and/or hayed during the blooming season (Feb through Sept)",{"$f":"1-FieldBeeForm!E307","v":0.9},1,0.9,1,0.9,0.9,null,"Mowing/haying disturbs ground nesting bees and floral resources."]
[null,{"$f":"FieldBeeForm!C308","v":33},"Total percent of the Map Unit NOT burned, mowed, or hayed during the blooming season",{"$f":"1-FieldBeeForm!E308","v":0.7},1,0.7,2,{"$f":"+F323*G323","v":1.4},{"$f":"H323/G323","v":0.7},null,"The less of the site with vegetation/soil disturbance, the less the impact to bees."]
[null,null,"Subtotal Sum of Management: Vegetation/Ground Disturbance Weights and Scores",null,null,null,{"$f":"SUM(G319:G323)","v":6},{"$f":"SUM(H319:H323)","v":4.3},{"$f":"H324/G324","v":0.71666666666666667},null,"This subsection of \"Vegetation/Ground disturbance\" was weighted as 12.5% of the total Map Unit score."]
[null,null,"TOTAL Sum of Management",null,null,null,{"$f":"G318+G324","v":12},{"$f":"H318+H324","v":6.1},{"$f":"H325/G325","v":0.5083333333333333},null,"This section of \"Management\" was weighted as approximately 1/4 of the total Map Unit score."," "]
[null,null,"Map Unit SCORE",null,null,null,{"$f":"(SUM(G299,G307,G312,G325,))","v":48},{"$f":"(SUM(H299,H307,H312,H325,))","v":18.758815426997245},{"$f":"H326/G326","v":0.39080865472910925}]
[null,null,"Map Unit ",{"$f":"D296","v":6},"Combined Score for this Map Unit and Project Area Capacity",null,null,null,{"$f":"0.4*I326+0.6*$I$29","v":0.28060917617735798},{"$f":"I327*H296","v":0.12883800559107345}]
["Combined Acres for Map Units:",{"$f":"H296","v":0.4591368227731864},null,null,"Combined Score for all Map Units to this point with the Project Area Capacity",null,null,null,{"$f":"0.4*((I$61*B$63+I$114*B$116+I$167*B$169+I$220*B$222+I$273*B$275+I$326*B328)/SUM(B$116,B$63, B$169,B$222, B$275, B$328))+0.6*I$29","v":0.30494426023360482},{"$f":"I328*B328","v":0.14001113876657706}]
[]
[]
[]
[]
[]
[]
[]
[]
[]
[]
[]
[]
[]
[]
[]
[]
[]
[]
[]
[]
[{"$f":"+FieldBeeForm!A336","v":7},null,"Map Unit Number:",{"$f":"+FieldBeeForm!A336","v":7},"Map Unit Acres:",null,null,{"$f":"FieldBeeForm!H335","v":0.4591368227731864}]
["Map Unit Characteristics",{"$f":"+FieldBeeForm!C$13","v":"F"},"Acres of Map Unit",{"$f":"+FieldBeeForm!H335","v":0.4591368227731864},{"$f":"+FieldBeeForm!$E$12*0.1","v":10},{"$f":"+D350/E350","v":4.5913682277318638E-2},6,{"$f":"+F350*G350","v":0.27548209366391185},{"$f":"H350/G350","v":4.5913682277318645E-2},null,"The more area of the Map Unit that provides nesting and/or foraging habitat for the pollinators, the better. Credit assigned linearly up to 10% of the total farm area (maximum).","Zurbuchen et al 2008, NRCS 2009"," "]
[null,{"$f":"+FieldBeeForm!C$15","v":"G"},"Percent of Map Unit that is covered with pollinator habitat",{"$f":"+IF(FieldBeeForm!E333<1, 0, IF(FieldBeeForm!E333<10, 1, IF(FieldBeeForm!E333<25, 2, IF(FieldBeeForm!E333<50, 3, IF(FieldBeeForm!E333<75, 4, IF(FieldBeeForm!E333< 85, 5, 6))))))","v":0},6,0,6,0,0,null,"Higher density habitat, vs. diffuse habitat, reduces energy required for pollinators and is therefore also better habitat. Bins set at <1, 1-10, 10-25, 25-50, 50-75, 75-85, >85.","NRCS 2009, Sim and Baltus 1987"," "]
[null,null,"Combined sum of Map Unit extent and density scores",null,null,null,{"$f":"+SUM(G350:G351)","v":12},{"$f":"+SUM(H350:H351)","v":0.27548209366391185},{"$f":"H352/G352","v":2.2956841138659322E-2}]
["Floral resources",{"$f":"FieldBeeForm!C337","v":12},{"$f":"FieldBeeForm!D337","v":"Number of different flowering plant species present during early-blooming (Feb-May) period"},{"$f":"IF(FieldBeeForm!G337>=5, 5, FieldBeeForm!G337)","v":5},5,{"$f":"+D353/E353","v":1},2,{"$f":"+F353*G353","v":2},{"$f":"H353/G353","v":1},null,"Research has shown that it is ideal to have 5 or more flowering plant species present during all seasons (the greater diversity of plants, the greater abundance and diversity of bees).","NRCS 2009, Bosch and Kemp 2001, Pontin et al. 2006, Holcomb 2009, Pywell et al. 2005"]
[null,{"$f":"FieldBeeForm!C338","v":13},{"$f":"FieldBeeForm!D338","v":"Number of different flowering plants present during mid-blooming (Jun-Jul) period"},{"$f":"IF(FieldBeeForm!G338>=5, 5, FieldBeeForm!G338)","v":5},5,1,2,2,1]
[null,{"$f":"FieldBeeForm!C339","v":14},{"$f":"FieldBeeForm!D339","v":"Number of different flowering plants present during late-blooming (Aug-Jan) period"},{"$f":"IF(FieldBeeForm!G339>=5, 5, FieldBeeForm!G339)","v":5},5,1,2,2,1]
[null,{"$f":"FieldBeeForm!C340","v":15},{"$f":"FieldBeeForm!D340","v":"Estimated surface area of flowering plants present during early-blooming (Feb-May) period"},{"$f":"IF(FieldBeeForm!I340=0,0,IF(FieldBeeForm!I340<0.05,1,IF(FieldBeeForm!I340<0.1,2,IF(FieldBeeForm!I340<0.15,3,IF(FieldBeeForm!I340<0.2,4,IF(FieldBeeForm!I340<0.25,5,6))))))","v":0},6,0,1,0,0,null,"Having floral resources available throughout the year supports diversity of pollinator species. Scoring is set at 0, 1 to 5, 5 to 10, 10 to 15, 15 to 20, 20 to 25, and over 25% for maximum score.","Zurbuchen et al 2008, NRCS 2009, Holcomb 2009, Pywell et al. 2005"," "]
[null,{"$f":"FieldBeeForm!C341","v":16},{"$f":"FieldBeeForm!D341","v":"Estimated surface area of flowering plants present during mid-blooming (Jun-Jul) period"},{"$f":"IF(FieldBeeForm!I341=0,0,IF(FieldBeeForm!I341<0.05,1,IF(FieldBeeForm!I341<0.1,2,IF(FieldBeeForm!I341<0.15,3,IF(FieldBeeForm!I341<0.2,4,IF(FieldBeeForm!I341<0.25,5,6))))))","v":0},6,0,1,0,0]
[null,{"$f":"FieldBeeForm!C342","v":17},{"$f":"FieldBeeForm!D342","v":"Estimated surface area of flowering plants present during late-blooming (Aug-Jan) period"},{"$f":"IF(FieldBeeForm!I342=0,0,IF(FieldBeeForm!I342<0.05,1,IF(FieldBeeForm!I342<0.1,2,IF(FieldBeeForm!I342<0.15,3,IF(FieldBeeForm!I342<0.2,4,IF(FieldBeeForm!I342<0.25,5,6))))))","v":0},6,0,1,0,0,null,null,null," "]
[null,null,"Combined coverage of floral resources",{"$f":"+IF(SUM(FieldBeeForm!I340:I342)<0,0, IF(SUM(FieldBeeForm!I340:I342)<0.05, 1, IF(SUM(FieldBeeForm!I340:I342)<0.1, 2, IF(SUM(FieldBeeForm!I340:I342)<0.2, 3, IF(SUM(FieldBeeForm!I340:I342)<0.5, 4, IF(SUM(FieldBeeForm!I340:I342)<0.75, 5, 6))))))","v":1},6,0.16666666666666666,3,0.5,0.16666666666666666]
[null,null,"Sum of Floral Resouces Weights and Scores",null,null,null,{"$f":"SUM(G353:G359)","v":12},{"$f":"SUM(H353:H359)","v":6.5},{"$f":"H360/G360","v":0.54166666666666663},null,"This section of \"Floral Resources\" was weighted as approximately 1/4 of the total Map Unit score."," "]
["Nesting materials",{"$f":"FieldBeeForm!C343","v":18},{"$f":"FieldBeeForm!D343","v":"Percent cover of friable bare ground present"},{"$f":"FieldBeeForm!E343","v":5.5E-2},0.3,{"$f":"+D361/E361","v":0.18333333333333335},3,{"$f":"+F361*G361","v":0.55000000000000004},{"$f":"H361/G361","v":0.18333333333333335},null,"70% native bees nest in soil.","Morandin and Winston 2006, Carvell 2004, Potts et al. 2005, Xerces Society for Invertebrate Conservation Society for Invertebrate Conservation 2011"," "]
[null,{"$f":"FieldBeeForm!C346","v":"19 and 20"},{"$f":"FieldBeeForm!D346","v":"Amount of rodent holes and/or bunch grasses"},{"$f":"FieldBeeForm!E346","v":1},2,{"$f":"+D362/E362","v":0.5},2,{"$f":"+F362*G362","v":1},0.5,null,"30% native bees nest in cavities including blue orchard bees.","Thorp et al. 1983, Kearns and Thomson 2001, McFrederick and LeBuhn 2006"]
[null,{"$f":"FieldBeeForm!C350","v":"21, 22 and 23"},{"$f":"FieldBeeForm!D350","v":"Amount of snags/stumps, nest boxes/bundles, pithy tissue"},{"$f":"FieldBeeForm!E350","v":1},2,{"$f":"+D363/E363","v":0.5},2,{"$f":"+F363*G363","v":1},0.5,null,"Bumble bees often nest or overwinter in rodent holes or within bunch grasses.","Bosch and Kemp 2001; Michener 2000; Xerces Society for Invertebrate Conservation Society for Invertebrate Conservation 2011; "]
[null,{"$f":"FieldBeeForm!C351","v":"18 through 23"},{"$f":"FieldBeeForm!D351","v":"Diversity of available nesting materials"},{"$f":"FieldBeeForm!E351","v":0.66666666666666663},1,{"$f":"+D364/E364","v":0.66666666666666663},5,{"$f":"+F364*G364","v":3.333333333333333},0.66666666666666663,null,"A diversity of nesting materials will support a diversity of pollinators.","Tscharntke et al. 1998, Cane 2001, Potts et al. 2005, Westrich 1996"]
[null,null,"Sum of Nesting Materials Weights and Scores",null,null,null,{"$f":"SUM(G361:G364)","v":12},{"$f":"SUM(H361:H364)","v":5.8833333333333329},{"$f":"H365/G365","v":0.49027777777777776},null,"This section of \"Nesting materials\" was weighted as approximately 1/4 of the total Map Unit score."," "]
["Management: Soil disturbance",{"$f":"FieldBeeForm!C352","v":24},"Is the Map Unit tilled at some point during the year? (0 = yes)",{"$f":"IF(FieldBeeForm!E352=0,1,0)","v":0},1,{"$f":"+D366/E366","v":0},1,{"$f":"+F366*G366","v":0},{"$f":"H366/G366","v":0},null,"Soil tilling disturbs ground nesting bees and favors aggressive nonnative plants.","Shuler et al. 2005, NRCS 2009, Xerces Society for Invertebrate Conservation 2011"]
[null,{"$f":"FieldBeeForm!C353","v":25},"Is the Map Unit flood-irrigated at some point during the year? (0 = yes)",{"$f":"IF(FieldBeeForm!E353=0,1,0)","v":1},1,{"$f":"+D367/E367","v":1},1,{"$f":"+F367*G367","v":1},1,null,"Flood irrigation drowns the underground life stages of ground nesting bees.","Vaughn et al. 2007, NRCS 2009, Xerces Society for Invertebrate Conservation 2011"]
[null,{"$f":"FieldBeeForm!C354","v":26},"Is plastic mulching used at the Map Unit? (0 = yes)",{"$f":"IF(FieldBeeForm!E354=0,1,0)","v":0},1,0,1,{"$f":"+F368*G368","v":0},0,null,"Plastic mulching traps the underground life stages of ground nesting bees.","NRCS 2009, Xerces Society for Invertebrate Conservation 2011"]
[null,{"$f":"FieldBeeForm!C355","v":27},"Does road-grading or road-making occur on the Map Unit? (0 = yes)",{"$f":"IF(FieldBeeForm!E355=0,1,0)","v":0},1,0,1,{"$f":"+F369*G369","v":0},0,null,"Road-grading/making distrubs the underground life stages of ground nesting bees.","NRCS 2009, Xerces Society for Invertebrate Conservation 2011"]
[null,{"$f":"FieldBeeForm!C356","v":28},"Total percent cover of map unit that does NOT experience soil disturbance.",{"$f":"1-FieldBeeForm!E356","v":0.4},1,{"$f":"+D370/E370","v":0.4},2,{"$f":"+F370*G370","v":0.8},0.4,null,"The less of the site with ground disturbance, the less the impact to bees.","NRCS 2009, Xerces Society for Invertebrate Conservation 2011"]
[null,null,"Subtotal Sum of Management: Soil Disturbance Weights and Scores",null,null,null,{"$f":"SUM(G366:G370)","v":6},{"$f":"SUM(H366:H370)","v":1.8},{"$f":"H371/G371","v":0.3},null,"This subsection of \"Soil disturbance\" was weighted as 12.5% of the total Map Unit score."]
["Management: Vegetation/ground disturbance",{"$f":"FieldBeeForm!C357","v":29},"Total cover NOT covered by invasive noxious weeds",{"$f":"1-FieldBeeForm!E357","v":1},1,{"$f":"+D372/E372","v":1},1,{"$f":"+F372*G372","v":1},{"$f":"H372/G372","v":1},null,"Aggressive nonnative plant species reduce overall plant diversity, which influences bee diversity.","Williams et al. 2010, NRCS 2009, Bosch and Kemp 2001, Pontin et al. 2006, Holcomb 2009, Pywell et al. 2005"," "]
[null,{"$f":"FieldBeeForm!C358","v":30},"FIVE MINUS the number of invasive noxious weed species",{"$f":"5-FieldBeeForm!E358","v":0},5,{"$f":"+D373/E373","v":0},1,0,0]
[null,{"$f":"FieldBeeForm!C359","v":31},"Percent of the Map Unit NOT burned during the blooming season (Feb through Sept)",{"$f":"1-FieldBeeForm!E359","v":1},1,1,1,1,1,null,"Burning disturbs ground nesting bees and floral resources.","Black et al. 2008, Hartley et al. 2007, Smallidge and Leopold 1997, Manguira and Thomas 1992,  NRCS 2009, Xerces Society for Invertebrate Conservation 2011"]
[null,{"$f":"FieldBeeForm!C360","v":32},"Percent of the Map Unit NOT mowed and/or hayed during the blooming season (Feb through Sept)",{"$f":"1-FieldBeeForm!E360","v":0.9},1,0.9,1,0.9,0.9,null,"Mowing/haying disturbs ground nesting bees and floral resources."]
[null,{"$f":"FieldBeeForm!C361","v":33},"Total percent of the Map Unit NOT burned, mowed, or hayed during the blooming season",{"$f":"1-FieldBeeForm!E361","v":0.7},1,0.7,2,{"$f":"+F376*G376","v":1.4},{"$f":"H376/G376","v":0.7},null,"The less of the site with vegetation/soil disturbance, the less the impact to bees."]
[null,null,"Subtotal Sum of Management: Vegetation/Ground Disturbance Weights and Scores",null,null,null,{"$f":"SUM(G372:G376)","v":6},{"$f":"SUM(H372:H376)","v":4.3},{"$f":"H377/G377","v":0.71666666666666667},null,"This subsection of \"Vegetation/Ground disturbance\" was weighted as 12.5% of the total Map Unit score."]
[null,null,"TOTAL Sum of Management",null,null,null,{"$f":"G371+G377","v":12},{"$f":"H371+H377","v":6.1},{"$f":"H378/G378","v":0.5083333333333333},null,"This section of \"Management\" was weighted as approximately 1/4 of the total Map Unit score."," "]
[null,null,"Map Unit SCORE",null,null,null,{"$f":"(SUM(G352,G360,G365,G378,))","v":48},{"$f":"(SUM(H352,H360,H365,H378,))","v":18.758815426997245},{"$f":"H379/G379","v":0.39080865472910925}]
[null,null,"Map Unit ",{"$f":"D349","v":7},"Combined Score for this Map Unit and Project Area Capacity",null,null,null,{"$f":"0.4*I379+0.6*$I$29","v":0.28060917617735798},{"$f":"I380*H349","v":0.12883800559107345}]
["Combined Acres for Map Units:",{"$f":"H349","v":0.4591368227731864},null,null,"Combined Score for all Map Units to this point with the Project Area Capacity",null,null,null,{"$f":"0.4*((I$61*B$63+I$114*B$116+I$167*B$169+I$220*B$222+I$273*B$275+I$326*B381+I$379*B$381)/SUM(B$116,B$63, B$169,B$222, B$275, B$328, B$382))+0.6*I$29","v":0.31233212203996336},{"$f":"I381*B381","v":0.1434031781634359}]
[]
[]
[]
[]
[]
[]
[]
[]
[]
[]
[]
[]
[]
[]
[]
[]
[]
[]
[]
[]
[{"$f":"+FieldBeeForm!A389","v":8},null,"Map Unit Number:",{"$f":"+FieldBeeForm!A389","v":8},"Map Unit Acres:",null,null,{"$f":"FieldBeeForm!H388","v":0.4591368227731864}]
["Map Unit Characteristics",{"$f":"+FieldBeeForm!C$13","v":"F"},"Acres of Map Unit",{"$f":"+FieldBeeForm!H388","v":0.4591368227731864},{"$f":"+FieldBeeForm!$E$12*0.1","v":10},{"$f":"+D403/E403","v":4.5913682277318638E-2},6,{"$f":"+F403*G403","v":0.27548209366391185},{"$f":"H403/G403","v":4.5913682277318645E-2},null,"The more area of the Map Unit that provides nesting and/or foraging habitat for the pollinators, the better. Credit assigned linearly up to 10% of the total farm area (maximum).","Zurbuchen et al 2008, NRCS 2009"," "]
[null,{"$f":"+FieldBeeForm!C$15","v":"G"},"Percent of Map Unit that is covered with pollinator habitat",{"$f":"+IF(FieldBeeForm!E386<1, 0, IF(FieldBeeForm!E386<10, 1, IF(FieldBeeForm!E386<25, 2, IF(FieldBeeForm!E386<50, 3, IF(FieldBeeForm!E386<75, 4, IF(FieldBeeForm!E386< 85, 5, 6))))))","v":0},6,0,6,0,0,null,"Higher density habitat, vs. diffuse habitat, reduces energy required for pollinators and is therefore also better habitat. Bins set at <1, 1-10, 10-25, 25-50, 50-75, 75-85, >85.","NRCS 2009, Sim and Baltus 1987"," "]
[null,null,"Combined sum of Map Unit extent and density scores",null,null,null,{"$f":"+SUM(G403:G404)","v":12},{"$f":"+SUM(H403:H404)","v":0.27548209366391185},{"$f":"H405/G405","v":2.2956841138659322E-2}]
["Floral resources",{"$f":"FieldBeeForm!C390","v":12},{"$f":"FieldBeeForm!D390","v":"Number of different flowering plant species present during early-blooming (Feb-May) period"},{"$f":"IF(FieldBeeForm!G390>=5, 5, FieldBeeForm!G390)","v":5},5,{"$f":"+D406/E406","v":1},2,{"$f":"+F406*G406","v":2},{"$f":"H406/G406","v":1},null,"Research has shown that it is ideal to have 5 or more flowering plant species present during all seasons (the greater diversity of plants, the greater abundance and diversity of bees).","NRCS 2009, Bosch and Kemp 2001, Pontin et al. 2006, Holcomb 2009, Pywell et al. 2005"]
[null,{"$f":"FieldBeeForm!C391","v":13},{"$f":"FieldBeeForm!D391","v":"Number of different flowering plants present during mid-blooming (Jun-Jul) period"},{"$f":"IF(FieldBeeForm!G391>=5, 5, FieldBeeForm!G391)","v":5},5,1,2,2,1]
[null,{"$f":"FieldBeeForm!C392","v":14},{"$f":"FieldBeeForm!D392","v":"Number of different flowering plants present during late-blooming (Aug-Jan) period"},{"$f":"IF(FieldBeeForm!G392>=5, 5, FieldBeeForm!G392)","v":5},5,1,2,2,1]
[null,{"$f":"FieldBeeForm!C393","v":15},{"$f":"FieldBeeForm!D393","v":"Estimated surface area of flowering plants present during early-blooming (Feb-May) period"},{"$f":"IF(FieldBeeForm!I393=0,0,IF(FieldBeeForm!I393<0.05,1,IF(FieldBeeForm!I393<0.1,2,IF(FieldBeeForm!I393<0.15,3,IF(FieldBeeForm!I393<0.2,4,IF(FieldBeeForm!I393<0.25,5,6))))))","v":0},6,0,1,0,0,null,"Having floral resources available throughout the year supports diversity of pollinator species. Scoring is set at 0, 1 to 5, 5 to 10, 10 to 15, 15 to 20, 20 to 25, and over 25% for maximum score.","Zurbuchen et al 2008, NRCS 2009, Holcomb 2009, Pywell et al. 2005"," "]
[null,{"$f":"FieldBeeForm!C394","v":16},{"$f":"FieldBeeForm!D394","v":"Estimated surface area of flowering plants present during mid-blooming (Jun-Jul) period"},{"$f":"IF(FieldBeeForm!I394=0,0,IF(FieldBeeForm!I394<0.05,1,IF(FieldBeeForm!I394<0.1,2,IF(FieldBeeForm!I394<0.15,3,IF(FieldBeeForm!I394<0.2,4,IF(FieldBeeForm!I394<0.25,5,6))))))","v":0},6,0,1,0,0]
[null,{"$f":"FieldBeeForm!C395","v":17},{"$f":"FieldBeeForm!D395","v":"Estimated surface area of flowering plants present during late-blooming (Aug-Jan) period"},{"$f":"IF(FieldBeeForm!I395=0,0,IF(FieldBeeForm!I395<0.05,1,IF(FieldBeeForm!I395<0.1,2,IF(FieldBeeForm!I395<0.15,3,IF(FieldBeeForm!I395<0.2,4,IF(FieldBeeForm!I395<0.25,5,6))))))","v":0},6,0,1,0,0,null,null,null," "]
[null,null,"Combined coverage of floral resources",{"$f":"+IF(SUM(FieldBeeForm!I393:I395)<0,0, IF(SUM(FieldBeeForm!I393:I395)<0.05, 1, IF(SUM(FieldBeeForm!I393:I395)<0.1, 2, IF(SUM(FieldBeeForm!I393:I395)<0.2, 3, IF(SUM(FieldBeeForm!I393:I395)<0.5, 4, IF(SUM(FieldBeeForm!I393:I395)<0.75, 5, 6))))))","v":1},6,0.16666666666666666,3,0.5,0.16666666666666666]
[null,null,"Sum of Floral Resouces Weights and Scores",null,null,null,{"$f":"SUM(G406:G412)","v":12},{"$f":"SUM(H406:H412)","v":6.5},{"$f":"H413/G413","v":0.54166666666666663},null,"This section of \"Floral Resources\" was weighted as approximately 1/4 of the total Map Unit score."," "]
["Nesting materials",{"$f":"FieldBeeForm!C396","v":18},{"$f":"FieldBeeForm!D396","v":"Percent cover of friable bare ground present"},{"$f":"FieldBeeForm!E396","v":5.5E-2},0.3,{"$f":"+D414/E414","v":0.18333333333333335},3,{"$f":"+F414*G414","v":0.55000000000000004},{"$f":"H414/G414","v":0.18333333333333335},null,"70% native bees nest in soil.","Morandin and Winston 2006, Carvell 2004, Potts et al. 2005, Xerces Society for Invertebrate Conservation Society for Invertebrate Conservation 2011"," "]
[null,{"$f":"FieldBeeForm!C399","v":"19 and 20"},{"$f":"FieldBeeForm!D399","v":"Amount of rodent holes and/or bunch grasses"},{"$f":"FieldBeeForm!E399","v":1},2,{"$f":"+D415/E415","v":0.5},2,{"$f":"+F415*G415","v":1},0.5,null,"30% native bees nest in cavities including blue orchard bees.","Thorp et al. 1983, Kearns and Thomson 2001, McFrederick and LeBuhn 2006"]
[null,{"$f":"FieldBeeForm!C403","v":"21, 22 and 23"},{"$f":"FieldBeeForm!D403","v":"Amount of snags/stumps, nest boxes/bundles, pithy tissue"},{"$f":"FieldBeeForm!E403","v":1},2,{"$f":"+D416/E416","v":0.5},2,{"$f":"+F416*G416","v":1},0.5,null,"Bumble bees often nest or overwinter in rodent holes or within bunch grasses.","Bosch and Kemp 2001; Michener 2000; Xerces Society for Invertebrate Conservation Society for Invertebrate Conservation 2011; "]
[null,{"$f":"FieldBeeForm!C404","v":"18 through 23"},{"$f":"FieldBeeForm!D404","v":"Diversity of available nesting materials"},{"$f":"FieldBeeForm!E404","v":0.66666666666666663},1,{"$f":"+D417/E417","v":0.66666666666666663},5,{"$f":"+F417*G417","v":3.333333333333333},0.66666666666666663,null,"A diversity of nesting materials will support a diversity of pollinators.","Tscharntke et al. 1998, Cane 2001, Potts et al. 2005, Westrich 1996"]
[null,null,"Sum of Nesting Materials Weights and Scores",null,null,null,{"$f":"SUM(G414:G417)","v":12},{"$f":"SUM(H414:H417)","v":5.8833333333333329},{"$f":"H418/G418","v":0.49027777777777776},null,"This section of \"Nesting materials\" was weighted as approximately 1/4 of the total Map Unit score."," "]
["Management: Soil disturbance",{"$f":"FieldBeeForm!C405","v":24},"Is the Map Unit tilled at some point during the year? (0 = yes)",{"$f":"IF(FieldBeeForm!E405=0,1,0)","v":0},1,{"$f":"+D419/E419","v":0},1,{"$f":"+F419*G419","v":0},{"$f":"H419/G419","v":0},null,"Soil tilling disturbs ground nesting bees and favors aggressive nonnative plants.","Shuler et al. 2005, NRCS 2009, Xerces Society for Invertebrate Conservation 2011"]
[null,{"$f":"FieldBeeForm!C406","v":25},"Is the Map Unit flood-irrigated at some point during the year? (0 = yes)",{"$f":"IF(FieldBeeForm!E406=0,1,0)","v":1},1,{"$f":"+D420/E420","v":1},1,{"$f":"+F420*G420","v":1},1,null,"Flood irrigation drowns the underground life stages of ground nesting bees.","Vaughn et al. 2007, NRCS 2009, Xerces Society for Invertebrate Conservation 2011"]
[null,{"$f":"FieldBeeForm!C407","v":26},"Is plastic mulching used at the Map Unit? (0 = yes)",{"$f":"IF(FieldBeeForm!E407=0,1,0)","v":0},1,0,1,{"$f":"+F421*G421","v":0},0,null,"Plastic mulching traps the underground life stages of ground nesting bees.","NRCS 2009, Xerces Society for Invertebrate Conservation 2011"]
[null,{"$f":"FieldBeeForm!C408","v":27},"Does road-grading or road-making occur on the Map Unit? (0 = yes)",{"$f":"IF(FieldBeeForm!E408=0,1,0)","v":0},1,0,1,{"$f":"+F422*G422","v":0},0,null,"Road-grading/making distrubs the underground life stages of ground nesting bees.","NRCS 2009, Xerces Society for Invertebrate Conservation 2011"]
[null,{"$f":"FieldBeeForm!C409","v":28},"Total percent cover of map unit that does NOT experience soil disturbance.",{"$f":"1-FieldBeeForm!E409","v":0.4},1,{"$f":"+D423/E423","v":0.4},2,{"$f":"+F423*G423","v":0.8},0.4,null,"The less of the site with ground disturbance, the less the impact to bees.","NRCS 2009, Xerces Society for Invertebrate Conservation 2011"]
[null,null,"Subtotal Sum of Management: Soil Disturbance Weights and Scores",null,null,null,{"$f":"SUM(G419:G423)","v":6},{"$f":"SUM(H419:H423)","v":1.8},{"$f":"H424/G424","v":0.3},null,"This subsection of \"Soil disturbance\" was weighted as 12.5% of the total Map Unit score."]
["Management: Vegetation/ground disturbance",{"$f":"FieldBeeForm!C410","v":29},"Total cover NOT covered by invasive noxious weeds",{"$f":"1-FieldBeeForm!E410","v":1},1,{"$f":"+D425/E425","v":1},1,{"$f":"+F425*G425","v":1},{"$f":"H425/G425","v":1},null,"Aggressive nonnative plant species reduce overall plant diversity, which influences bee diversity.","Williams et al. 2010, NRCS 2009, Bosch and Kemp 2001, Pontin et al. 2006, Holcomb 2009, Pywell et al. 2005"," "]
[null,{"$f":"FieldBeeForm!C411","v":30},"FIVE MINUS the number of invasive noxious weed species",{"$f":"5-FieldBeeForm!E411","v":0},5,{"$f":"+D426/E426","v":0},1,0,0]
[null,{"$f":"FieldBeeForm!C412","v":31},"Percent of the Map Unit NOT burned during the blooming season (Feb through Sept)",{"$f":"1-FieldBeeForm!E412","v":1},1,1,1,1,1,null,"Burning disturbs ground nesting bees and floral resources.","Black et al. 2008, Hartley et al. 2007, Smallidge and Leopold 1997, Manguira and Thomas 1992,  NRCS 2009, Xerces Society for Invertebrate Conservation 2011"]
[null,{"$f":"FieldBeeForm!C413","v":32},"Percent of the Map Unit NOT mowed and/or hayed during the blooming season (Feb through Sept)",{"$f":"1-FieldBeeForm!E413","v":0.9},1,0.9,1,0.9,0.9,null,"Mowing/haying disturbs ground nesting bees and floral resources."]
[null,{"$f":"FieldBeeForm!C414","v":33},"Total percent of the Map Unit NOT burned, mowed, or hayed during the blooming season",{"$f":"1-FieldBeeForm!E414","v":0.7},1,0.7,2,{"$f":"+F429*G429","v":1.4},{"$f":"H429/G429","v":0.7},null,"The less of the site with vegetation/soil disturbance, the less the impact to bees."]
[null,null,"Subtotal Sum of Management: Vegetation/Ground Disturbance Weights and Scores",null,null,null,{"$f":"SUM(G425:G429)","v":6},{"$f":"SUM(H425:H429)","v":4.3},{"$f":"H430/G430","v":0.71666666666666667},null,"This subsection of \"Vegetation/Ground disturbance\" was weighted as 12.5% of the total Map Unit score."]
[null,null,"TOTAL Sum of Management",null,null,null,{"$f":"G424+G430","v":12},{"$f":"H424+H430","v":6.1},{"$f":"H431/G431","v":0.5083333333333333},null,"This section of \"Management\" was weighted as approximately 1/4 of the total Map Unit score."," "]
[null,null,"Map Unit SCORE",null,null,null,{"$f":"(SUM(G405,G413,G418,G431,))","v":48},{"$f":"(SUM(H405,H413,H418,H431,))","v":18.758815426997245},{"$f":"H432/G432","v":0.39080865472910925}]
[null,null,"Map Unit ",{"$f":"D402","v":8},"Combined Score for this Map Unit and Project Area Capacity",null,null,null,{"$f":"0.4*I432+0.6*$I$29","v":0.28060917617735798},{"$f":"I433*H402","v":0.12883800559107345}]
["Combined Acres for Map Units:",{"$f":"H402","v":0.4591368227731864},null,null,"Combined Score for all Map Units to this point with the Project Area Capacity",null,null,null,{"$f":"0.4*((I$61*B$63+I$114*B$116+I$167*B$169+I$220*B$222+I$273*B$275+I$326*B434+I$379*B$381+I$432*B$434)/SUM(B$116,B$63, B$169,B$222, B$275, B$328, B$382, B$434))+0.6*I$29","v":0.31090054886084811},{"$f":"I434*B434","v":0.1427458902024096}]
[]
[]
[]
[]
[]
[]
[]
[]
[]
[]
[]
[]
[]
[]
[]
[]
[]
[]
[]
[]
[{"$f":"+FieldBeeForm!A442","v":9},null,"Map Unit Number:",{"$f":"+FieldBeeForm!A442","v":9},"Map Unit Acres:",null,null,{"$f":"FieldBeeForm!H441","v":0.4591368227731864}]
["Map Unit Characteristics",{"$f":"+FieldBeeForm!C$13","v":"F"},"Acres of Map Unit",{"$f":"+FieldBeeForm!H441","v":0.4591368227731864},{"$f":"+FieldBeeForm!$E$12*0.1","v":10},{"$f":"+D456/E456","v":4.5913682277318638E-2},6,{"$f":"+F456*G456","v":0.27548209366391185},{"$f":"H456/G456","v":4.5913682277318645E-2},null,"The more area of the Map Unit that provides nesting and/or foraging habitat for the pollinators, the better. Credit assigned linearly up to 10% of the total farm area (maximum).","Zurbuchen et al 2008, NRCS 2009"," "]
[null,{"$f":"+FieldBeeForm!C$15","v":"G"},"Percent of Map Unit that is covered with pollinator habitat",{"$f":"+IF(FieldBeeForm!E439<1, 0, IF(FieldBeeForm!E439<10, 1, IF(FieldBeeForm!E439<25, 2, IF(FieldBeeForm!E439<50, 3, IF(FieldBeeForm!E439<75, 4, IF(FieldBeeForm!E439< 85, 5, 6))))))","v":0},6,0,6,0,0,null,"Higher density habitat, vs. diffuse habitat, reduces energy required for pollinators and is therefore also better habitat. Bins set at <1, 1-10, 10-25, 25-50, 50-75, 75-85, >85.","NRCS 2009, Sim and Baltus 1987"," "]
[null,null,"Combined sum of Map Unit extent and density scores",null,null,null,{"$f":"+SUM(G456:G457)","v":12},{"$f":"+SUM(H456:H457)","v":0.27548209366391185},{"$f":"H458/G458","v":2.2956841138659322E-2}]
["Floral resources",{"$f":"FieldBeeForm!C443","v":12},{"$f":"FieldBeeForm!D443","v":"Number of different flowering plant species present during early-blooming (Feb-May) period"},{"$f":"IF(FieldBeeForm!G443>=5, 5, FieldBeeForm!G443)","v":5},5,{"$f":"+D459/E459","v":1},2,{"$f":"+F459*G459","v":2},{"$f":"H459/G459","v":1},null,"Research has shown that it is ideal to have 5 or more flowering plant species present during all seasons (the greater diversity of plants, the greater abundance and diversity of bees).","NRCS 2009, Bosch and Kemp 2001, Pontin et al. 2006, Holcomb 2009, Pywell et al. 2005"]
[null,{"$f":"FieldBeeForm!C444","v":13},{"$f":"FieldBeeForm!D444","v":"Number of different flowering plants present during mid-blooming (Jun-Jul) period"},{"$f":"IF(FieldBeeForm!G444>=5, 5, FieldBeeForm!G444)","v":5},5,1,2,2,1]
[null,{"$f":"FieldBeeForm!C445","v":14},{"$f":"FieldBeeForm!D445","v":"Number of different flowering plants present during late-blooming (Aug-Jan) period"},{"$f":"IF(FieldBeeForm!G445>=5, 5, FieldBeeForm!G445)","v":5},5,1,2,2,1]
[null,{"$f":"FieldBeeForm!C446","v":15},{"$f":"FieldBeeForm!D446","v":"Estimated surface area of flowering plants present during early-blooming (Feb-May) period"},{"$f":"IF(FieldBeeForm!I446=0,0,IF(FieldBeeForm!I446<0.05,1,IF(FieldBeeForm!I446<0.1,2,IF(FieldBeeForm!I446<0.15,3,IF(FieldBeeForm!I446<0.2,4,IF(FieldBeeForm!I446<0.25,5,6))))))","v":0},6,0,1,0,0,null,"Having floral resources available throughout the year supports diversity of pollinator species. Scoring is set at 0, 1 to 5, 5 to 10, 10 to 15, 15 to 20, 20 to 25, and over 25% for maximum score.","Zurbuchen et al 2008, NRCS 2009, Holcomb 2009, Pywell et al. 2005"," "]
[null,{"$f":"FieldBeeForm!C447","v":16},{"$f":"FieldBeeForm!D447","v":"Estimated surface area of flowering plants present during mid-blooming (Jun-Jul) period"},{"$f":"IF(FieldBeeForm!I447=0,0,IF(FieldBeeForm!I447<0.05,1,IF(FieldBeeForm!I447<0.1,2,IF(FieldBeeForm!I447<0.15,3,IF(FieldBeeForm!I447<0.2,4,IF(FieldBeeForm!I447<0.25,5,6))))))","v":0},6,0,1,0,0]
[null,{"$f":"FieldBeeForm!C448","v":17},{"$f":"FieldBeeForm!D448","v":"Estimated surface area of flowering plants present during late-blooming (Aug-Jan) period"},{"$f":"IF(FieldBeeForm!I448=0,0,IF(FieldBeeForm!I448<0.05,1,IF(FieldBeeForm!I448<0.1,2,IF(FieldBeeForm!I448<0.15,3,IF(FieldBeeForm!I448<0.2,4,IF(FieldBeeForm!I448<0.25,5,6))))))","v":0},6,0,1,0,0,null,null,null," "]
[null,null,"Combined coverage of floral resources",{"$f":"+IF(SUM(FieldBeeForm!I446:I448)<0,0, IF(SUM(FieldBeeForm!I446:I448)<0.05, 1, IF(SUM(FieldBeeForm!I446:I448)<0.1, 2, IF(SUM(FieldBeeForm!I446:I448)<0.2, 3, IF(SUM(FieldBeeForm!I446:I448)<0.5, 4, IF(SUM(FieldBeeForm!I446:I448)<0.75, 5, 6))))))","v":1},6,0.16666666666666666,3,0.5,0.16666666666666666]
[null,null,"Sum of Floral Resouces Weights and Scores",null,null,null,{"$f":"SUM(G459:G465)","v":12},{"$f":"SUM(H459:H465)","v":6.5},{"$f":"H466/G466","v":0.54166666666666663},null,"This section of \"Floral Resources\" was weighted as approximately 1/4 of the total Map Unit score."," "]
["Nesting materials",{"$f":"FieldBeeForm!C449","v":18},{"$f":"FieldBeeForm!D449","v":"Percent cover of friable bare ground present"},{"$f":"FieldBeeForm!E449","v":5.5E-2},0.3,{"$f":"+D467/E467","v":0.18333333333333335},3,{"$f":"+F467*G467","v":0.55000000000000004},{"$f":"H467/G467","v":0.18333333333333335},null,"70% native bees nest in soil.","Morandin and Winston 2006, Carvell 2004, Potts et al. 2005, Xerces Society for Invertebrate Conservation Society for Invertebrate Conservation 2011"," "]
[null,{"$f":"FieldBeeForm!C452","v":"19 and 20"},{"$f":"FieldBeeForm!D452","v":"Amount of rodent holes and/or bunch grasses"},{"$f":"FieldBeeForm!E452","v":1},2,{"$f":"+D468/E468","v":0.5},2,{"$f":"+F468*G468","v":1},0.5,null,"30% native bees nest in cavities including blue orchard bees.","Thorp et al. 1983, Kearns and Thomson 2001, McFrederick and LeBuhn 2006"]
[null,{"$f":"FieldBeeForm!C456","v":"21, 22 and 23"},{"$f":"FieldBeeForm!D456","v":"Amount of snags/stumps, nest boxes/bundles, pithy tissue"},{"$f":"FieldBeeForm!E456","v":1},2,{"$f":"+D469/E469","v":0.5},2,{"$f":"+F469*G469","v":1},0.5,null,"Bumble bees often nest or overwinter in rodent holes or within bunch grasses.","Bosch and Kemp 2001; Michener 2000; Xerces Society for Invertebrate Conservation Society for Invertebrate Conservation 2011; "]
[null,{"$f":"FieldBeeForm!C457","v":"18 through 23"},{"$f":"FieldBeeForm!D457","v":"Diversity of available nesting materials"},{"$f":"FieldBeeForm!E457","v":0.66666666666666663},1,{"$f":"+D470/E470","v":0.66666666666666663},5,{"$f":"+F470*G470","v":3.333333333333333},0.66666666666666663,null,"A diversity of nesting materials will support a diversity of pollinators.","Tscharntke et al. 1998, Cane 2001, Potts et al. 2005, Westrich 1996"]
[null,null,"Sum of Nesting Materials Weights and Scores",null,null,null,{"$f":"SUM(G467:G470)","v":12},{"$f":"SUM(H467:H470)","v":5.8833333333333329},{"$f":"H471/G471","v":0.49027777777777776},null,"This section of \"Nesting materials\" was weighted as approximately 1/4 of the total Map Unit score."," "]
["Management: Soil disturbance",{"$f":"FieldBeeForm!C458","v":24},"Is the Map Unit tilled at some point during the year? (0 = yes)",{"$f":"IF(FieldBeeForm!E458=0,1,0)","v":0},1,{"$f":"+D472/E472","v":0},1,{"$f":"+F472*G472","v":0},{"$f":"H472/G472","v":0},null,"Soil tilling disturbs ground nesting bees and favors aggressive nonnative plants.","Shuler et al. 2005, NRCS 2009, Xerces Society for Invertebrate Conservation 2011"]
[null,{"$f":"FieldBeeForm!C459","v":25},"Is the Map Unit flood-irrigated at some point during the year? (0 = yes)",{"$f":"IF(FieldBeeForm!E459=0,1,0)","v":1},1,{"$f":"+D473/E473","v":1},1,{"$f":"+F473*G473","v":1},1,null,"Flood irrigation drowns the underground life stages of ground nesting bees.","Vaughn et al. 2007, NRCS 2009, Xerces Society for Invertebrate Conservation 2011"]
[null,{"$f":"FieldBeeForm!C460","v":26},"Is plastic mulching used at the Map Unit? (0 = yes)",{"$f":"IF(FieldBeeForm!E460=0,1,0)","v":0},1,0,1,{"$f":"+F474*G474","v":0},0,null,"Plastic mulching traps the underground life stages of ground nesting bees.","NRCS 2009, Xerces Society for Invertebrate Conservation 2011"]
[null,{"$f":"FieldBeeForm!C461","v":27},"Does road-grading or road-making occur on the Map Unit? (0 = yes)",{"$f":"IF(FieldBeeForm!E461=0,1,0)","v":0},1,0,1,{"$f":"+F475*G475","v":0},0,null,"Road-grading/making distrubs the underground life stages of ground nesting bees.","NRCS 2009, Xerces Society for Invertebrate Conservation 2011"]
[null,{"$f":"FieldBeeForm!C462","v":28},"Total percent cover of map unit that does NOT experience soil disturbance.",{"$f":"1-FieldBeeForm!E462","v":0.4},1,{"$f":"+D476/E476","v":0.4},2,{"$f":"+F476*G476","v":0.8},0.4,null,"The less of the site with ground disturbance, the less the impact to bees.","NRCS 2009, Xerces Society for Invertebrate Conservation 2011"]
[null,null,"Subtotal Sum of Management: Soil Disturbance Weights and Scores",null,null,null,{"$f":"SUM(G472:G476)","v":6},{"$f":"SUM(H472:H476)","v":1.8},{"$f":"H477/G477","v":0.3},null,"This subsection of \"Soil disturbance\" was weighted as 12.5% of the total Map Unit score."]
["Management: Vegetation/ground disturbance",{"$f":"FieldBeeForm!C463","v":29},"Total cover NOT covered by invasive noxious weeds",{"$f":"1-FieldBeeForm!E463","v":1},1,{"$f":"+D478/E478","v":1},1,{"$f":"+F478*G478","v":1},{"$f":"H478/G478","v":1},null,"Aggressive nonnative plant species reduce overall plant diversity, which influences bee diversity.","Williams et al. 2010, NRCS 2009, Bosch and Kemp 2001, Pontin et al. 2006, Holcomb 2009, Pywell et al. 2005"," "]
[null,{"$f":"FieldBeeForm!C464","v":30},"FIVE MINUS the number of invasive noxious weed species",{"$f":"5-FieldBeeForm!E464","v":0},5,{"$f":"+D479/E479","v":0},1,0,0]
[null,{"$f":"FieldBeeForm!C465","v":31},"Percent of the Map Unit NOT burned during the blooming season (Feb through Sept)",{"$f":"1-FieldBeeForm!E465","v":1},1,1,1,1,1,null,"Burning disturbs ground nesting bees and floral resources.","Black et al. 2008, Hartley et al. 2007, Smallidge and Leopold 1997, Manguira and Thomas 1992,  NRCS 2009, Xerces Society for Invertebrate Conservation 2011"]
[null,{"$f":"FieldBeeForm!C466","v":32},"Percent of the Map Unit NOT mowed and/or hayed during the blooming season (Feb through Sept)",{"$f":"1-FieldBeeForm!E466","v":0.9},1,0.9,1,0.9,0.9,null,"Mowing/haying disturbs ground nesting bees and floral resources."]
[null,{"$f":"FieldBeeForm!C467","v":33},"Total percent of the Map Unit NOT burned, mowed, or hayed during the blooming season",{"$f":"1-FieldBeeForm!E467","v":0.7},1,0.7,2,{"$f":"+F482*G482","v":1.4},{"$f":"H482/G482","v":0.7},null,"The less of the site with vegetation/soil disturbance, the less the impact to bees."]
[null,null,"Subtotal Sum of Management: Vegetation/Ground Disturbance Weights and Scores",null,null,null,{"$f":"SUM(G478:G482)","v":6},{"$f":"SUM(H478:H482)","v":4.3},{"$f":"H483/G483","v":0.71666666666666667},null,"This subsection of \"Vegetation/Ground disturbance\" was weighted as 12.5% of the total Map Unit score."]
[null,null,"TOTAL Sum of Management",null,null,null,{"$f":"G477+G483","v":12},{"$f":"H477+H483","v":6.1},{"$f":"H484/G484","v":0.5083333333333333},null,"This section of \"Management\" was weighted as approximately 1/4 of the total Map Unit score."," "]
[null,null,"Map Unit SCORE",null,null,null,{"$f":"(SUM(G458,G466,G471,G484,))","v":48},{"$f":"(SUM(H458,H466,H471,H484,))","v":18.758815426997245},{"$f":"H485/G485","v":0.39080865472910925}]
[null,null,"Map Unit ",{"$f":"D455","v":9},"Combined Score for this Map Unit and Project Area Capacity",null,null,null,{"$f":"0.4*I485+0.6*$I$29","v":0.28060917617735798},{"$f":"I486*H455","v":0.12883800559107345}]
["Combined Acres for Map Units:",{"$f":"H455","v":0.4591368227731864},null,null,"Combined Score for all Map Units to this point with the Project Area Capacity",null,null,null,{"$f":"0.4*((I$61*B$63+I$114*B$116+I$167*B$169+I$220*B$222+I$273*B$275+I$326*B487+I$379*B$381+I$432*B$434+I$485*B$487)/SUM(B$116,B$63, B$169,B$222, B$275, B$328, B$382, B$434,B$487))+0.6*I$29","v":0.30959260297758245},{"$f":"I487*B487","v":0.14214536408520773}]
[]
[]
[]
[]
[]
[]
[]
[]
[]
[]
[]
[]
[]
[]
[]
[]
[]
[]
[]
[]
[{"$f":"+FieldBeeForm!A495","v":10},null,"Map Unit Number:",{"$f":"+FieldBeeForm!A495","v":10},"Map Unit Acres:",null,null,{"$f":"FieldBeeForm!H494","v":0.4591368227731864}]
["Map Unit Characteristics",{"$f":"+FieldBeeForm!C$13","v":"F"},"Acres of Map Unit",{"$f":"+FieldBeeForm!H494","v":0.4591368227731864},{"$f":"+FieldBeeForm!$E$12*0.1","v":10},{"$f":"+D509/E509","v":4.5913682277318638E-2},6,{"$f":"+F509*G509","v":0.27548209366391185},{"$f":"H509/G509","v":4.5913682277318645E-2},null,"The more area of the Map Unit that provides nesting and/or foraging habitat for the pollinators, the better. Credit assigned linearly up to 10% of the total farm area (maximum).","Zurbuchen et al 2008, NRCS 2009"," "]
[null,{"$f":"+FieldBeeForm!C$15","v":"G"},"Percent of Map Unit that is covered with pollinator habitat",{"$f":"+IF(FieldBeeForm!E492<1, 0, IF(FieldBeeForm!E492<10, 1, IF(FieldBeeForm!E492<25, 2, IF(FieldBeeForm!E492<50, 3, IF(FieldBeeForm!E492<75, 4, IF(FieldBeeForm!E492< 85, 5, 6))))))","v":0},6,0,6,0,0,null,"Higher density habitat, vs. diffuse habitat, reduces energy required for pollinators and is therefore also better habitat. Bins set at <1, 1-10, 10-25, 25-50, 50-75, 75-85, >85.","NRCS 2009, Sim and Baltus 1987"," "]
[null,null,"Combined sum of Map Unit extent and density scores",null,null,null,{"$f":"+SUM(G509:G510)","v":12},{"$f":"+SUM(H509:H510)","v":0.27548209366391185},{"$f":"H511/G511","v":2.2956841138659322E-2}]
["Floral resources",{"$f":"FieldBeeForm!C496","v":12},{"$f":"FieldBeeForm!D496","v":"Number of different flowering plant species present during early-blooming (Feb-May) period"},{"$f":"IF(FieldBeeForm!G496>=5, 5, FieldBeeForm!G496)","v":5},5,{"$f":"+D512/E512","v":1},2,{"$f":"+F512*G512","v":2},{"$f":"H512/G512","v":1},null,"Research has shown that it is ideal to have 5 or more flowering plant species present during all seasons (the greater diversity of plants, the greater abundance and diversity of bees).","NRCS 2009, Bosch and Kemp 2001, Pontin et al. 2006, Holcomb 2009, Pywell et al. 2005"]
[null,{"$f":"FieldBeeForm!C497","v":13},{"$f":"FieldBeeForm!D497","v":"Number of different flowering plants present during mid-blooming (Jun-Jul) period"},{"$f":"IF(FieldBeeForm!G497>=5, 5, FieldBeeForm!G497)","v":5},5,1,2,2,1]
[null,{"$f":"FieldBeeForm!C498","v":14},{"$f":"FieldBeeForm!D498","v":"Number of different flowering plants present during late-blooming (Aug-Jan) period"},{"$f":"IF(FieldBeeForm!G498>=5, 5, FieldBeeForm!G498)","v":5},5,1,2,2,1]
[null,{"$f":"FieldBeeForm!C499","v":15},{"$f":"FieldBeeForm!D499","v":"Estimated surface area of flowering plants present during early-blooming (Feb-May) period"},{"$f":"IF(FieldBeeForm!I499=0,0,IF(FieldBeeForm!I499<0.05,1,IF(FieldBeeForm!I499<0.1,2,IF(FieldBeeForm!I499<0.15,3,IF(FieldBeeForm!I499<0.2,4,IF(FieldBeeForm!I499<0.25,5,6))))))","v":0},6,0,1,0,0,null,"Having floral resources available throughout the year supports diversity of pollinator species. Scoring is set at 0, 1 to 5, 5 to 10, 10 to 15, 15 to 20, 20 to 25, and over 25% for maximum score.","Zurbuchen et al 2008, NRCS 2009, Holcomb 2009, Pywell et al. 2005"," "]
[null,{"$f":"FieldBeeForm!C500","v":16},{"$f":"FieldBeeForm!D500","v":"Estimated surface area of flowering plants present during mid-blooming (Jun-Jul) period"},{"$f":"IF(FieldBeeForm!I500=0,0,IF(FieldBeeForm!I500<0.05,1,IF(FieldBeeForm!I500<0.1,2,IF(FieldBeeForm!I500<0.15,3,IF(FieldBeeForm!I500<0.2,4,IF(FieldBeeForm!I500<0.25,5,6))))))","v":0},6,0,1,0,0]
[null,{"$f":"FieldBeeForm!C501","v":17},{"$f":"FieldBeeForm!D501","v":"Estimated surface area of flowering plants present during late-blooming (Aug-Jan) period"},{"$f":"IF(FieldBeeForm!I501=0,0,IF(FieldBeeForm!I501<0.05,1,IF(FieldBeeForm!I501<0.1,2,IF(FieldBeeForm!I501<0.15,3,IF(FieldBeeForm!I501<0.2,4,IF(FieldBeeForm!I501<0.25,5,6))))))","v":0},6,0,1,0,0,null,null,null," "]
[null,null,"Combined coverage of floral resources",{"$f":"+IF(SUM(FieldBeeForm!I499:I501)<0,0, IF(SUM(FieldBeeForm!I499:I501)<0.05, 1, IF(SUM(FieldBeeForm!I499:I501)<0.1, 2, IF(SUM(FieldBeeForm!I499:I501)<0.2, 3, IF(SUM(FieldBeeForm!I499:I501)<0.5, 4, IF(SUM(FieldBeeForm!I499:I501)<0.75, 5, 6))))))","v":1},6,0.16666666666666666,3,0.5,0.16666666666666666]
[null,null,"Sum of Floral Resouces Weights and Scores",null,null,null,{"$f":"SUM(G512:G518)","v":12},{"$f":"SUM(H512:H518)","v":6.5},{"$f":"H519/G519","v":0.54166666666666663},null,"This section of \"Floral Resources\" was weighted as approximately 1/4 of the total Map Unit score."," "]
["Nesting materials",{"$f":"FieldBeeForm!C502","v":18},{"$f":"FieldBeeForm!D502","v":"Percent cover of friable bare ground present"},{"$f":"FieldBeeForm!E502","v":5.5E-2},0.3,{"$f":"+D520/E520","v":0.18333333333333335},3,{"$f":"+F520*G520","v":0.55000000000000004},{"$f":"H520/G520","v":0.18333333333333335},null,"70% native bees nest in soil.","Morandin and Winston 2006, Carvell 2004, Potts et al. 2005, Xerces Society for Invertebrate Conservation Society for Invertebrate Conservation 2011"," "]
[null,{"$f":"FieldBeeForm!C505","v":"19 and 20"},{"$f":"FieldBeeForm!D505","v":"Amount of rodent holes and/or bunch grasses"},{"$f":"FieldBeeForm!E505","v":1},2,{"$f":"+D521/E521","v":0.5},2,{"$f":"+F521*G521","v":1},0.5,null,"30% native bees nest in cavities including blue orchard bees.","Thorp et al. 1983, Kearns and Thomson 2001, McFrederick and LeBuhn 2006"]
[null,{"$f":"FieldBeeForm!C509","v":"21, 22 and 23"},{"$f":"FieldBeeForm!D509","v":"Amount of snags/stumps, nest boxes/bundles, pithy tissue"},{"$f":"FieldBeeForm!E509","v":1},2,{"$f":"+D522/E522","v":0.5},2,{"$f":"+F522*G522","v":1},0.5,null,"Bumble bees often nest or overwinter in rodent holes or within bunch grasses.","Bosch and Kemp 2001; Michener 2000; Xerces Society for Invertebrate Conservation Society for Invertebrate Conservation 2011; "]
[null,{"$f":"FieldBeeForm!C510","v":"18 through 23"},{"$f":"FieldBeeForm!D510","v":"Diversity of available nesting materials"},{"$f":"FieldBeeForm!E510","v":0.66666666666666663},1,{"$f":"+D523/E523","v":0.66666666666666663},5,{"$f":"+F523*G523","v":3.333333333333333},0.66666666666666663,null,"A diversity of nesting materials will support a diversity of pollinators.","Tscharntke et al. 1998, Cane 2001, Potts et al. 2005, Westrich 1996"]
[null,null,"Sum of Nesting Materials Weights and Scores",null,null,null,{"$f":"SUM(G520:G523)","v":12},{"$f":"SUM(H520:H523)","v":5.8833333333333329},{"$f":"H524/G524","v":0.49027777777777776},null,"This section of \"Nesting materials\" was weighted as approximately 1/4 of the total Map Unit score."," "]
["Management: Soil disturbance",{"$f":"FieldBeeForm!C511","v":24},"Is the Map Unit tilled at some point during the year? (0 = yes)",{"$f":"IF(FieldBeeForm!E511=0,1,0)","v":0},1,{"$f":"+D525/E525","v":0},1,{"$f":"+F525*G525","v":0},{"$f":"H525/G525","v":0},null,"Soil tilling disturbs ground nesting bees and favors aggressive nonnative plants.","Shuler et al. 2005, NRCS 2009, Xerces Society for Invertebrate Conservation 2011"]
[null,{"$f":"FieldBeeForm!C512","v":25},"Is the Map Unit flood-irrigated at some point during the year? (0 = yes)",{"$f":"IF(FieldBeeForm!E512=0,1,0)","v":1},1,{"$f":"+D526/E526","v":1},1,{"$f":"+F526*G526","v":1},1,null,"Flood irrigation drowns the underground life stages of ground nesting bees.","Vaughn et al. 2007, NRCS 2009, Xerces Society for Invertebrate Conservation 2011"]
[null,{"$f":"FieldBeeForm!C513","v":26},"Is plastic mulching used at the Map Unit? (0 = yes)",{"$f":"IF(FieldBeeForm!E513=0,1,0)","v":0},1,0,1,{"$f":"+F527*G527","v":0},0,null,"Plastic mulching traps the underground life stages of ground nesting bees.","NRCS 2009, Xerces Society for Invertebrate Conservation 2011"]
[null,{"$f":"FieldBeeForm!C514","v":27},"Does road-grading or road-making occur on the Map Unit? (0 = yes)",{"$f":"IF(FieldBeeForm!E514=0,1,0)","v":0},1,0,1,{"$f":"+F528*G528","v":0},0,null,"Road-grading/making distrubs the underground life stages of ground nesting bees.","NRCS 2009, Xerces Society for Invertebrate Conservation 2011"]
[null,{"$f":"FieldBeeForm!C515","v":28},"Total percent cover of map unit that does NOT experience soil disturbance.",{"$f":"1-FieldBeeForm!E515","v":0.4},1,{"$f":"+D529/E529","v":0.4},2,{"$f":"+F529*G529","v":0.8},0.4,null,"The less of the site with ground disturbance, the less the impact to bees.","NRCS 2009, Xerces Society for Invertebrate Conservation 2011"]
[null,null,"Subtotal Sum of Management: Soil Disturbance Weights and Scores",null,null,null,{"$f":"SUM(G525:G529)","v":6},{"$f":"SUM(H525:H529)","v":1.8},{"$f":"H530/G530","v":0.3},null,"This subsection of \"Soil disturbance\" was weighted as 12.5% of the total Map Unit score."]
["Management: Vegetation/ground disturbance",{"$f":"FieldBeeForm!C516","v":29},"Total cover NOT covered by invasive noxious weeds",{"$f":"1-FieldBeeForm!E516","v":1},1,{"$f":"+D531/E531","v":1},1,{"$f":"+F531*G531","v":1},{"$f":"H531/G531","v":1},null,"Aggressive nonnative plant species reduce overall plant diversity, which influences bee diversity.","Williams et al. 2010, NRCS 2009, Bosch and Kemp 2001, Pontin et al. 2006, Holcomb 2009, Pywell et al. 2005"," "]
[null,{"$f":"FieldBeeForm!C517","v":30},"FIVE MINUS the number of invasive noxious weed species",{"$f":"5-FieldBeeForm!E517","v":0},5,{"$f":"+D532/E532","v":0},1,0,0]
[null,{"$f":"FieldBeeForm!C518","v":31},"Percent of the Map Unit NOT burned during the blooming season (Feb through Sept)",{"$f":"1-FieldBeeForm!E518","v":1},1,1,1,1,1,null,"Burning disturbs ground nesting bees and floral resources.","Black et al. 2008, Hartley et al. 2007, Smallidge and Leopold 1997, Manguira and Thomas 1992,  NRCS 2009, Xerces Society for Invertebrate Conservation 2011"]
[null,{"$f":"FieldBeeForm!C519","v":32},"Percent of the Map Unit NOT mowed and/or hayed during the blooming season (Feb through Sept)",{"$f":"1-FieldBeeForm!E519","v":0.9},1,0.9,1,0.9,0.9,null,"Mowing/haying disturbs ground nesting bees and floral resources."]
[null,{"$f":"FieldBeeForm!C520","v":33},"Total percent of the Map Unit NOT burned, mowed, or hayed during the blooming season",{"$f":"1-FieldBeeForm!E520","v":0.7},1,0.7,2,{"$f":"+F535*G535","v":1.4},{"$f":"H535/G535","v":0.7},null,"The less of the site with vegetation/soil disturbance, the less the impact to bees."]
[null,null,"Subtotal Sum of Management: Vegetation/Ground Disturbance Weights and Scores",null,null,null,{"$f":"SUM(G531:G535)","v":6},{"$f":"SUM(H531:H535)","v":4.3},{"$f":"H536/G536","v":0.71666666666666667},null,"This subsection of \"Vegetation/Ground disturbance\" was weighted as 12.5% of the total Map Unit score."]
[null,null,"TOTAL Sum of Management",null,null,null,{"$f":"G530+G536","v":12},{"$f":"H530+H536","v":6.1},{"$f":"H537/G537","v":0.5083333333333333},null,"This section of \"Management\" was weighted as approximately 1/4 of the total Map Unit score."," "]
[null,null,"Map Unit SCORE",null,null,null,{"$f":"(SUM(G511,G519,G524,G537,))","v":48},{"$f":"(SUM(H511,H519,H524,H537,))","v":18.758815426997245},{"$f":"H538/G538","v":0.39080865472910925}]
[null,null,"Map Unit ",{"$f":"D508","v":10},"Combined Score for this Map Unit and Project Area Capacity",null,null,null,{"$f":"0.4*I538+0.6*$I$29","v":0.28060917617735798},{"$f":"I539*H508","v":0.12883800559107345}]
["Combined Acres for Map Units:",{"$f":"H508","v":0.4591368227731864},null,null,"Combined Score for all Map Units to this point with the Project Area Capacity",null,null,null,{"$f":"0.4*((I$61*B$63+I$114*B$116+I$167*B$169+I$220*B$222+I$273*B$275+I$326*B540+I$379*B$381+I$432*B$434+I$485*B$487+I$538*B$540)/SUM(B$116,B$63, B$169,B$222, B$275, B$328, B$382, B$434,B$487, B$540))+0.6*I$29","v":0.30839293300095943},{"$f":"I540*B540","v":0.14159455142376465}]

{"sheet":"VegTypeParameters","index":5,"n_rows":78,"n_cols":9,"rows_kept":78,"cut":false,"hidden":false,"merged":[[0,8,0,16]]}
["Species/VegType Code","Scientific Name or Description","Common Name or Description","Ht max (m)","Ht Rate (m/y)","Canopy Width Max (m)","Canopy Width Rate (m/y)","Blooming Season","Explanation: Height growth rates (meters of growth per year) are based on species specific values published by the USDA where no California Central Valley or Delta empirical riparian data are available. For most species, empirical data on growth rates during the first five years are available. Maximum heights are all from the USDA publication. Canopy width (e.g. distance from drip line to drip line) and canopy width growth rate is also included as a variable based on empirical measurements from the Delta and Sacramento Valley. Canopy width by age is then combined with stem density at the site in order to calculate total canopy closure for the stand (as opposed to by individual). Height is calculated based on the maximum height, measured growth rate, age using the logistic equation: Ht = Hmax *(1-exp(-rate*age/Hmax))."]
[1000,"Acmispon (Lotus)","bird's-foot trefoil",1.5,0.5,1.75,0.5,"Early/Mid"]
[1100,"Amorpha ","desert false indigo",3,0.37499999999999994,6,0.74999999999999989,"Mid"]
[1200,"Amsinckia","fiddleneck",0.5,0.5,0.2,0.2,"Early/Mid"]
[1300,"Row crops","Annual crops",0,0,0,0,"Never"]
[1400,"Arctostaphylos","Manzanita",3,0.7,3,0.11249999999999998,"Early/Mid"]
[1500,"Asclepias","milkweed",0.8,0.8,0.2,0.2,"Early/Mid/Late"]
[1600,"Atriplex","saltbush",3,3.2962962962962963,5,7.1111111111111107,"Mid/Late"]
[1700,"Baccharis pilularis","coyote brush",2,0.34,2,0.39,"Late"]
[1800,"Baccharis salicifolia","mule's fat",4,5.6999999999999993,2.5,6.8999999999999986,"Early/Mid/Late"]
[1900,"Bunch grass/sedge","Bunch grass/sedge",1.088888888888889,0.78400000000000014,0.6777777777777777,0.48799999999999999,"Mid"," "]
[2000,"Ceanothus","buckbrush, California lilac, deerbrush",3,0.34999999999999992,3.6666666666666665,0.46666666666666662,"Early/Mid"," "]
[2100,"Cephalanthus","button willow, button bush",3.5,0.53,3,0.61,"Late"]
[2200,"Cercis","California redbud",7,0.7,6,0.6,"Early"]
[2300,"Chamerion","fireweed",3,8.9999999999999982,1,2.9999999999999996,"Mid"]
[2400,"Chrysothamnus","yellow rabbitbrush",1.5,0.6,1,0.4,"Mid"]
[2500,"Clarkia","clarkia",0.4,0.4,0.1,0.1,"Early/Mid"]
[2600,"Cornus","redosier dogwood",4,0.66666666666666663,4,0.66666666666666663,"Mid"]
[2700,"Emergent wetland plants","Emergent wetland plants",0,0,0,0,"Never"]
[2800,"Epilobium","California fuchsia",0.2,0.1,1,0.2,"Mid/Late"]
[2900,"Erigeron","horseweed",2,2,0.5,0.5,"Early/Mid/Late"]
[3000,"Eriodictyon","California yerba santa",3,0.75,4,1,"Early/Mid"]
[3100,"Eriogonum ","Buckwheat",1.8333333333333333,0.875,1.8333333333333333,0.625,"Early/Mid/Late"]
[3200,"Eriophyllum","common woolly sunflower",0.4,0.4,0.3,0.2,"Mid"]
[3300,"Eschscholzia","California poppy",0.3,0.6,0.15,0.3,"Early/Mid"]
[3400,"Euthamia","western goldentop",2,2,0.5,0.5,"Mid/Late"]
[3500,"Ficus carica","fig",0,0,0,0,"Never"]
[3600,"Frangula ","California buckthorn",5.5,2.75,3.5,1.7,"Early/Mid"]
[3700,"Fremontodendron","Fremontia (Flannel bush)",3.2,0.21333333333333335,4,0.26666666666666666,"Early/Mid"," "]
[3800,"Gilia","bird's-eye gilia",0.3,0.6,0.15,0.3,"Mid"]
[3900,"Glycyrrhiza","American licorice",1.2,0.39999999999999997,1.2,0.39999999999999997,"Mid"]
[4000,"Grindelia","Great Valley gumweed",2.5,1.6666666666666667,2,1.3333333333333333,"Mid/Late"]
[4100,"Helenium ","rosilla",1.6,1.6,0.5,0.5,"Mid"]
[4200,"Helianthus","sunflower",2.5,6.5,0.75,1.25,"Mid/Late"]
[4300,"Heliotropium ","Heliotrope",0.3,0.3,1,1,"Early/Mid/Late"]
[4400,"Heteromeles","toyon",5,0.83333333333333337,6,1,"Mid"]
[4500,"Holodiscus ","oceanspray",4,0.2,4,0.2,"Mid"," "]
[4600,"Horkelia ","Horkelia",0.75,0.75,1,0.75,"Early/Mid"]
[4700,"Juglans","Walnut",30,1,12,0.75,"Early"]
[4800,"Lavandula spp.","Lavender",0.5,0.5,0.5,0.25,"Early/Mid/Late"]
[4900,"Layia ","Tidytips",0.5,0.7,0.1,0.1,"Early/Mid"]
[5000,"Lupinus spp.","lupine",3,0.98000000000000009,3,1.08,"Early/Mid/Late"]
[5100,"Madia","Madia",0.5,0.5,0.1,0.1,"Early/Mid/Late"]
[5200,"Mahonia","Oregon grape",2,0.8,2,0.8,"Early/Mid"]
[5300,"Medicago ","alfalfa",0.5,0.5,0.7,0.7,"Mid/Late"]
[5400,"Mimulus","sticky monkey flower",1,0.3,1.5,0.3,"Mid"]
[5500,"Monardella","coyote mint",0.5,0.25,0.5,0.25,"Mid"]
[5600,"Native forbs and graminoids not beneficial to pollinators","Native forbs and graminoids not beneficial to pollinators",0,0,0,0,"Never"]
[5700,"Native trees and shrubs not beneficial to bees","Native trees and shrubs not beneficial to bees",0,0,0,0,"Never"]
[5800,"Nemophila","fivespot",0.15,0.4499999999999999,0.15,0.4499999999999999,"Early"]
[5900,"Oenothera","Hooker's evening primrose",1.7,1.7,0.3,0.3,"Mid"]
[6000,"Orchard","peach/plum/almond/cherry/apple ",10,0.5,6,0.5,"Early"]
[6100,"Other early blooming native plants beneficial to pollinators","Other early blooming native plants beneficial to pollinators",1,0.25,0.5,0.25,"Early"]
[6200,"Other late blooming native plants beneficial to pollinators","Other late blooming native plants beneficial to pollinators",1,0.25,0.5,0.25,"Late"]
[6300,"Other mid blooming native plants beneficial to pollinators","Other mid blooming native plants beneficial to pollinators",1,0.25,0.5,0.25,"Mid"]
[6400,"Penstemon","Penstemon",1,0.4,1,0.4,"Mid"]
[6500,"Phacelia ","Phacelia",0.83333333333333337,0.96666666666666667,0.3666666666666667,0.66666666666666663,"Early/Mid"]
[6600,"Philadelphus lewisii","Lewis' mock orange",3,0.2,3,0.2,"Mid"]
[6700,"Phyla nodiflora","turkey tangle fogfruit",0.1,0.3,0.5,1.4999999999999998,"Mid/Late"]
[6800,"Punica granatum","pomegranate",6,0.3,8,0.5,"Mid"]
[6900,"Rosa californica","California wildrose",1.5,1,2,1,"Early/Mid/Late"]
[7000,"Salix (shrub)","shrub willows",3.5,0.73,2.5,0.55000000000000004,"Early"]
[7100,"Salix (tree)","Tree willows",12,2,10,0.24,"Early"]
[7200,"Salix spp.","Willows (many species)",10,0.73,7.5,0.55000000000000004,"Early"]
[7300,"Salvia","sage",1.75,0.5,3,1,"Early/Mid"]
[7400,"Sambucus","blue elderberry",5,0.5,3.5,0.38,"Early"]
[7500,"Scrophularia","Figwort",1.2,1.2,0.3,0.3,"Early/Mid"]
[7600,"Solidago","California goldenrod",1.5,1.5,0.5,0.5,"Mid/Late"]
[7700,"Stachys","Hedgenettle",2.5,2.5,0.5,0.5,"Mid"]
[7800,"Symphyotrichum (Aster)","Pacific aster",5,2,1,0.5,"Mid/Late"]
[7900,"Trichostema","vinegarweed",1,1,0.5,0.5,"Mid/Late"]
[8000,"Triteleia ","Ithuriel's spear",0.6,0.6,0.2,0.2,"Early/Mid"]
[8100,"Vineyard","Vineyard",2,0.5,2,0.55000000000000004,"Never"]
[8200,"WATER","WATER",0,0,0,0,"Never"]
[8300,"Weeds invasive and not beneficial to pollinators","Weeds invasive and not beneficial to pollinators",0,0,0,0,"Never"]
[8400,"Weeds, non-invasive and not beneficial to pollinators","Weeds, non-invasive and not beneficial to pollinators",0,0,0,0,"Never"]
[8500,"Other Exotic Shrubs","Other Exotic Shrubs",3,2,3,1,"Early/Mid/Late"]
[8600,"Other Exotic Trees","Other Exotic Trees",30,1,15,0.25,"Early/Mid/Late"]

{"sheet":"References","index":6,"n_rows":44,"n_cols":2,"rows_kept":44,"cut":false,"hidden":false,"merged":[]}
["Citation","Notes"]
["Badano, E.I. and C.H. Vergara. 2011. Potential negative effects of exotic honey bees on the diversity of native pollinators and yield of a highland coffee plantations. Agricultural and Forest Entomology. No. doi: 10.1111/j. 1461--9563.2011.00527x","Honey bees can compete with native bees for resources, reducing native bee pollinator services"]
["Black, S.H., N. Hodges, M. Vaughan and M. Shepherd. 2008. Pollinators in Natural Areas:A Primer on Habitat Management. Publication by the Xerxes Society, available online at: http://www.xerces.org/wp-content/uploads/2008/11/pollinators_in_natural_areas_xerces_society.pdf","Protect overwintering pollinators and foraging larvae and adults by burning, mowing, and or haying only part of the farm at a time -- to give them someplace to go."]
["Bosch, J., and W. Kemp. 2001. How to manage the Blue Orchard Bee as an Orchard Pollinator. Sustainable Agriculture Network, Handbook Series Book 5. National Agricultural Library. Beltsville, MD. "]
["Cane, J.H. 2001. Habitat fragmentation and native bees: a premature verdict? Conservation\nEcology 5(1):3 [online] URL: http://www.consecol.org/vol5/is1/art3.","Honey bees can compete with native bees for resources, reducing native bee pollinator services"]
["Carvell, C. 2002. Habitat use and conservation of bumblebees (Bombus spp.) under different\ngrassland management regimes. Biological Conservation. 103:33-49.","Bumble bees like have variety in landscape -- more with more hedgerows"]
["Decourtye, A., J. Devillers, S. Cluzeau, M. Charreton, and M.-H. Pham-Delegue. 2004. Effects of imidacloprid and deltamethrin on associative learning in honeybees under semi-Þeld and laboratory conditions. Ecotoxicol. Environ. Saf. 57: 410Ð419.","Insecticides can affect foraging and nesting behavior - even at sublethal doses"]
["Desneux, N., A. Decourtye, and J.-M. Delpuech. 2007. The\nsublethal effects of pesticides on beneÞcial arthropods.\nAnnu. Rev. Entomol. 52: 81Ð106.","Insecticides can affect foraging and nesting behavior - even at sublethal doses"]
["Everich, R., C. Schiller, J. Whitehead, M. Beavers, and K. Barrett. 2009. Effects of Captan on Apis millifer brood development under field conditions in California almond orchards. Journal of Economic Entomology. 102(1): 20-29."]
["Gess, F. W., and S. K. Gess. 1993. Effects of increasing land utilization on species representation and diversity of aculeate wasps and bees in the semi-arid areas of southern Africa. In Hymenoptera and Biodiversity, edited by J. La Salle and I. D. Gauld, 83-113. Wallingford: CAB International.","Grazing disturbs ground nesters"]
["Greenleaf, S. S., N. M. Williams, R. Winfree, and C. Kremen. 2007. Bee foraging ranges and their relationship to body size. Oecologia 153: 589–596 "]
["Hartley, M. K., W. E. Rogers, E. Siemann, and J. Grace. 2007. Responses of prairie arthropod\ncommunities to fire and fertilizer: balancing plant and arthropod conservation. American\nMidland Naturalist 157:92-105.","Pollinator populations can recolonize a site after disturbance if only parts of the farm are subjected to soil/nest maintenance activity at a time."]
["Johansen, E. W., and Mayer, D. F. 1990. Pollinator Protection: A Bee and Pesticide\nHandbook. Wicwas Press. Cheshire, CT.","Night time insecticide application kills fewer pollinators"]
["Johansen, C. A. 1977. Pesticides and pollinators. Annual Review of Entomology 22:177-192.","Insecticides kill pollinators"]
["Kearns, C. A., and J. D. Thompson. 2001. The Natural History of Bumblebees. A Sourcebook\nfor Investigations. Boulder: University Press of Colorado. 130pp."]
["Klein, A., B.E. Vaissiere, J.H. Cane, I. Steffan-Dewenter, S.A. Cunningham, C. Kremen, and T. Tscharntke. 2007. The importance of pollinators in changing landscapes for world crops. Proceedings of the Royal Society B 274:303-313. http://rspb.royalsocietypublishing.org/content/274/1608/303.full.pdf+html."]
["Kremen, C. 2010. Landuse categories defined for Yolo landcover layer. Defined July 13, 2009; updated February 26, 2010."]
["Kremen, C., N. M. Williams, M. A. Aizen, B. Gemmill-Herren, G. LeBuhn, R. Minckley, L. Packer, S. G. Potts, T. Roulston, I. Steffan-Dewenter, D. P. Vazquez, R. Winfree, L. Adams, E. E. Crone, S. S. Greenleaf, T. H. Keitt, A. Klein, J. Regetz, and T. H. Ricketts. 2007. Pollination and other ecosystem services produced by mobile organisms: a conceptual framework for the effects of land-use change. Ecology Letters 10: 299–314."]
["Munguira, M.L. and J.A. Thomas. 1992. Use of road verges by butterfly and burnet populations and the effect of roads on adult dispersal and mortality. Journal of Applied Ecology . 29(316-329).","Road edges can be planted with floral resource and managed with open soil/nesting resources -- road kill insignif."]
["McFrederick, Q. S. and G. LeBuhn. 2006. Are urban parks refuges for bumble bees Bombus\nspp. (Hymenoptera: Apidae)? Biological Conservation. 129:372-382","Patches of rough undisturbed grass where rodents can nest can create future nesting sites for bumble bees"]
["Michener, C.D. 2000. The Bees of the World. 913 pp. Baltimore: John Hopkins University\nPress.","Wood nesters mostly solitary -- some can chew out centers of woody plant stems and twigs - like in elderberry or even soft pines."]
["Morandin, L., and M. Winston. 2006. Pollinators provide economic incentive to preserve natural land in agroecosystems. Agriculture, Ecosystems and Environment 116:289-292."]
["NRCS (Natural Resources Conservation Science). 2009. Pollinator biology and habitat in California. Biology Technical Note No. CA—19 190-VI. Davis, California."]
["Ozkan, H. E. 2000. Reducing Spray Drift. Ohio State University Extension Bulletin. 816-00.\nColumbus, OH","Pesticide drift depends on application method, wind velocityies, and spray formulation, and weather (inversions, thermals, etc.)"]
["Pilling, E.D., K.A.C. Bromley-Challenor, C.II. Walker, and P.C. Jepson. Mechanisms of synergism between the Pyrethroid insecticide lambda-cyhalothrin and the imidazole fungicide prochloraz, in the honeybee (Apis mellifera L.). Pesticide Biogeochemistry and Physiology. 52 (1-11)."]
["Pontin, D.R. M.R. Wade, P. Kehrli, and S.D. Wratten. 2006. Attractiveness of single and multiple species flower patches to beneficial insects in agroecosystems. Annals of Applied Biology. 148 (pp. 39-47)."]
["Potts, S. G., B. Vulliamy, S. Roberts, C. O’Toole, A. Dafni, G. Ne’eman, and P. G. Willmer.\n2005. Role of nesting resources in organizing diverse bee communities in a Mediterranean\nlandscape. Ecological Entomology 30:78-85.","Gorund nesters need access to soil surface to excavate and get into and out of their nests - sand, loamy sands are great."]
["Pywell, R.F., E.A. Warman, C. Carvell, T.H. Sparks, L.V. Dicks, D. Bennett, A. Wright,\nC.N.R. Critchley, A. Sherwood. 2005. Providing foraging resources for bumblebees in\nintensively farmed landscapes. Biological Conservation. 121:479-494."]
["Riedl, H., E. Johnson, L. Brewer, and J. Barbour. 2006. How to Reduce Bee Poisoning From\nPesticides. Pacific Northwest Extension Publication. PNW 591. Corvallis, OR: Oregon\nState University.","Night time insecticide application kills fewer pollinators"]
["Schmuck, R., T. Stadler, and H. Schmidt. 2003. Field relevanct of synergistic effect observed in the laboratory between EBI fungicide and a chloronicotinyl insecticide in the honeybee. Pest Management Science. 59: 279-286."]
["Shuler, R. E., T. H. Roulston, and G. E. Farris. 2005. Farming practices influence wild\npollinator populations on squash and pumpkin. Journal of Economic Entomology 98:790-\n795.","Tilling kills ground nesting bees"]
["Smallidge, P. J., and D. J. Leopold. 1997. Vegetation management for the maintenance and\nconservation of butterfly habitats in temperate human-dominated habitats. Landscape and\nUrban Planning 38:259-280.","Avoid maintenance activities while plants are in flower to minimize losses and set backs in foragin and/or egg-laying"]
["Tew, J. E. 1997. Protecting Honey Bees from Pesticides. Ohio State University. Extension\nFactsheet HYG-2161-97.","Night time insecticide application kills fewer pollinators"]
["Thompson, H. M. 2003. Behavioural effects of pesticides use in bees – their potential for use in\nrisk assessment. Ecotoxicology 12:317-330.","Insecticides can affect foraging and nesting behavior - even at sublethal doses"]
["Tscharntke, T., A. Gathmann, and I. Steffan-Dewenter. 1998. Bioindication using trap-nesting\nbees and wasps and their natural enemies: community structure and interactions. Journal of\nApplied Ecology 35:708-719."]
["UC Statewide IPM Program. 2009. Scientists track blue orchard bees as promising pollinators for almonds. 2009 Annual Report. Website. http://www.ipm.ucdavis.edu/IPMPROJECT/2009/orchardbees.html [Accessed 11 May 2011]."]
["Vaughan, M., M. Shepherd, C. Kremen, S.H. Black. 2007. Farming for bees: Guidelines for providing native bee habitat on farms. Xerces Society for Invertebrate Conservation, Portland, Oregon. ISBN: 978-0-9744475-1-3. Available online at: http://www.xerces.org/wp-content/uploads/2008/11/farming_for_bees_guidelines_xerces_society.pdf","Flood irrigating kill ground nesting bees"]
["Vinson, S. B., G. W. Frankie, and J. Barthell. 1993. Threats to the diversity of solitary bees in a\nneotropical dry forest in Central America. In Hymenoptera and Biodiversity, edited by J. La\nSalle and I. D. Gauld, 53-82. Wallingford: CAB International.","Grazing disturbs ground nesters"]
["Westrich, P. 1996. Habitat requirements of central European bees and the problems of partial\nhabitats. In Conservation of Bees, edited by A. Matheson, S. L. Buchmann, C. O’Toole, P.\nWestrich, and I. H. Williams, 1-16. London: Academic Press.","Nesting and forage materials can be separate, but not too far apart"]
["Williams, N. M., and C. Kremen. 2007. Resource distribution among habitats determine\nsolitary bee offspring production in a mosaic landscape. Ecological Applications 17:910-\n921."]
["Williams, N.M., D. Cariveau, R. Winfree, and C. Kremen. 2010. Bees in disturbed habitats use, but do not prefer, alien plants. Basic and Applied Ecology. "]
["Xerces Society for Invertebrate Conservation. 2011. Pollinator Plants for California Hedgerows and Rangeland Restoration. 1 page."]
["Zhong, H., M. Latham, S. Payne, and C. Brock. 2004. Minimizing the impact of the\nmosquito adulticide naled on honey bees, Apis mellifera (Hymenoptera: Apidae):\nAerial ultra-low-volume application using a high-pressure nozzle system. Journal of\nEconomic Entomology 97:1-7.","Broad spectrum pesticides are to be avoided"]
["Zurbuchen, A., L. Landert, J. Klaiber, A. Müller, S. Hein, S. Dorn.  2010. Maximum foraging ranges in solitary bees: only few individuals have the capability to cover long foraging distances. Biological Conservation. Doi: 10.1016/j.biocon.2009.12.003.","Bee forage distance should not be set at maximum distance possible, rather ~ one -half of that in order to address the greater number of pollinator movements."]